program: Gaussian 09
title: 000230103
version: EM64L-G09RevD.01
frameworkgroup: C1[X(C7H6INO3)]
method: RPBEPBE
basis: SDD
operation: Freq
keyword: #p
keyword: freq=noraman
keyword: PBEPBE/SDD
title: #p freq=noraman PBEPBE/SDD
converged: NO YES NO NO
title: Mulliken charges:
elementType: I O O O N C C C C C C C H H H H H H
charge: 0.175848 -0.256578 -0.202828 -0.212158 0.021570 0.556237 0.401441 -0.470258 -0.581120 -0.381694 -0.095336 -0.533692 0.304138 0.292856 0.258094 0.233799 0.233783 0.255899
chargesum: 0.00000
title: Mulliken charges with hydrogens summed into heavy atoms:
elementType: I O O O N C C C C C C C
charge: 0.175848 -0.256578 -0.202828 -0.212158 0.021570 0.556237 0.401441 -0.166120 -0.581120 -0.088838 0.162758 0.189788
polarizability: 2.08832355e+02 4.14550308e+00 1.27157979e+02 5.58031141e-03 -1.20966605e-02 4.47076469e+01
1716.lowfreq: -7.4061 -4.7319 -0.0004 -0.0002 0.0004 5.6130 54.2424 70.5965 106.5792
frequency: 54.2320 70.5877 106.5743 128.6558 150.3856 178.0040 209.0038 245.7301 290.5150 291.6649 414.8643 443.7999 475.4484 499.5166 548.8107 581.6881 659.3142 700.4847 722.4051 739.6102 830.3424 874.9724 895.2883 969.7259 991.0699 1004.6237 1088.4673 1112.7527 1125.7914 1157.9924 1209.7209 1235.2980 1252.0803 1364.6870 1387.2417 1403.9428 1438.1445 1457.4953 1470.0071 1472.8616 1566.8235 1600.5879 2971.1682 3064.9188 3141.3172 3167.6027 3188.5411 3196.4982
redmass: 10.7521 9.0648 3.4786 7.7910 5.5840 2.3987 15.7975 1.5544 4.7573 4.2259 7.4277 3.2777 7.4379 7.2278 5.7919 5.1495 7.5051 6.4132 3.5219 10.5829 1.3722 6.7616 1.5621 1.3494 6.7081 6.9262 1.9407 1.2574 1.4188 1.3554 8.9034 3.7572 1.3926 6.1890 6.1971 4.0574 1.5693 1.8939 1.0488 1.1426 6.6049 8.5310 1.0327 1.1048 1.1002 1.0907 1.0908 1.0959
irintensity: 0.8195 0.6392 8.7122 0.5808 5.3015 2.9539 0.4748 1.4185 0.6696 0.9655 3.8782 6.0488 1.3668 7.1170 0.0750 12.6685 3.1624 26.6376 0.8715 37.7485 19.2709 11.2538 48.5656 1.5547 39.1737 91.7250 8.4615 0.0853 13.0409 4.3506 410.6265 141.0882 25.2397 22.6978 81.7057 111.6885 19.7335 145.1154 16.2380 3.3015 67.8208 47.6683 43.0296 35.8138 13.2961 2.5825 4.7629 3.1718
temp: 298.150 k
press: 1.00000 atm
elementType: 53 8 8 8 7 6 6 6 6 6 6 6 1 1 1 1 1 1
symmnumber: 1
zpe: 317915.1 jmol-1
zpe.correction: 0.121087 hartree
zpe.thermalcorrener: 0.132410 hartree
zpe.thermalcorrenthalpy: 0.133354 hartree
zpe.thermalcorrgfe: 0.081616 hartree
zpe.sumelectzpe: -561.296742 hartree
zpe.sumelectthermal: -561.285419 hartree
zpe.sumelectthermalent: -561.284475 hartree
zpe.sumelectthermalfe: -561.336213 hartree
dipole: 3.2944 1.7455 0.0096
dipole: 3.7283
quadrupole: -109.4081 -69.3307 -84.7514
quadrupole: -4.5277 0.0009 -0.0086
quadrupole: -21.5781 18.4994 3.0787 -4.5277 0.0009 -0.0086
hfenergy: -561.4178291 hartree
pointgroup: C01 [X(C7H6I1N1O3)]
dipole: 1.4591349 0.1494682 -0.0113446 debye
dipolederiv: -0.4753363 0.2050318 -0.0336201 0.24137 -0.0053168 0.0109061 -0.0402666 0.0111498 0.0571252 -0.7330666 -0.7563584 0.1114629 -0.5800963 -1.0769994 0.1169114 0.0878762 0.1182918 -0.3021321 -1.0138689 -0.0848888 0.0080347 -0.2008794 -0.4753881 0.0360992 0.025365 0.036969 -0.2313081 -0.6118334 0.1439787 -0.0238985 0.2994142 -0.8518218 0.0947093 -0.0473678 0.0943278 -0.2448027 1.9754218 -0.3176607 0.0584422 -0.3763626 1.1926594 -0.1526462 0.0676945 -0.1535696 0.2081578 0.3636265 1.2483875 -0.1876305 0.8048854 0.4228789 -0.0334177 -0.1226305 -0.0332784 0.1812024 -0.7283667 0.4349246 -0.0702789 0.3443861 0.0714364 0.00266 -0.0570317 0.0041549 0.079938 0.0587613 -0.5389112 0.0831582 0.2416963 -0.1869698 0.003434 -0.0349144 -0.000806 -0.1708185 1.0612849 -0.5494613 0.0891313 -0.6569862 -0.0059687 -0.0346291 0.1061882 -0.0349833 -0.2060554 0.0581631 -0.0060274 0.0016768 -0.3311347 -0.0796675 -0.0108324 0.0510381 -0.0089666 -0.137463 -0.4687632 0.0725716 -0.0129719 0.1038887 0.1079315 -0.0251339 -0.0176658 -0.0252894 -0.0556128 0.2041154 0.0043112 -0.0010247 0.2422478 0.8045475 -0.0728952 -0.0368575 -0.0740802 0.3239762 0.1307344 0.0407814 -0.0065 -0.0267012 0.0459186 0.0204369 0.0034495 0.0207269 0.1768982 0.0560779 -0.0420257 0.0058727 -0.0055148 0.0944386 0.0138998 0.000589 0.0135122 0.1829576 0.0892364 0.0281537 -0.0044833 0.0257371 -0.0276144 0.0279507 -0.0041884 0.0280876 0.149581 0.0498503 0.1316527 0.0952006 -0.0272109 -0.0468929 -0.0220034 0.0754557 -0.0630172 -0.0571612 0.0518905 0.0977942 -0.1281825 -0.0481294 -0.0240283 0.0114749 -0.063003 0.0540422 -0.0824582 -0.0679273 -0.112254 0.0156108 -0.05061 0.0408566 0.0130757 0.0062693 0.0127286 0.1279756 unknown
polarizability: 200.1872575|-25.0579207|133.7223538|4.5792931|-13.5969187|46.7883695 unknown
InChI: InChI=1S/C7H6INO3/c1-12-7-4-5(9(10)11)2-3-6(7)8/h2-4H,1H3
charge 0 multiplicity 1
18 atoms
I  3.503353 -2.005303 0.164371
O  2.486828 0.960237 -0.290759
O  -3.42888 -0.436871 -0.110061
O  -2.557598 1.648557 -0.417645
N  -2.432961 0.375888 -0.225961
C  1.342595 0.186093 -0.17647
C  -1.0618 -0.184109 -0.133838
C  0.028365 0.701383 -0.263127
C  1.527472 -1.214232 0.035078
C  -0.898207 -1.56664 0.078069
C  0.416068 -2.072753 0.161342
C  2.328625 2.405225 -0.506347
H  -0.174853 1.761898 -0.427005
H  -1.77145 -2.21517 0.173117
H  0.576948 -3.141444 0.325938
H  1.788204 2.876535 0.336487
H  1.799069 2.608442 -1.456359
H  3.354822 2.794163 -0.558028
