program: Gaussian 09
title: 000021753
version: EM64L-G09RevD.01
frameworkgroup: C1[X(C6H4ClNO4)]
method: RPBEPBE
basis: SDD
operation: Freq
keyword: #p
keyword: freq=noraman
keyword: PBEPBE/SDD
title: #p freq=noraman PBEPBE/SDD
converged: NO YES NO NO
title: Mulliken charges:
elementType: Cl O O O O N C C C C C C H H H H
charge: -0.000051 -0.214298 -0.158923 -0.192321 -0.177705 0.052872 0.260450 -0.282601 0.288224 -0.295626 0.196951 -0.676112 0.300494 0.301892 0.298394 0.298360
chargesum: 0.00000
title: Mulliken charges with hydrogens summed into heavy atoms:
elementType: Cl O O O O N C C C C C C
charge: -0.000051 -0.214298 -0.158923 -0.192321 -0.177705 0.052872 0.260450 0.017893 0.288224 0.006266 0.196951 -0.079358
polarizability: 1.66573720e+02 -8.44484783e+00 1.02899268e+02 9.11608285e-03 -3.66063126e-03 3.98307530e+01
1716.lowfreq: -9.4037 -3.5272 -0.0026 -0.0009 0.0021 2.2954 33.2395 53.1828 74.4922
frequency: 33.1071 53.1445 74.4903 75.3807 130.9566 191.1867 227.9494 239.1191 305.4500 375.9746 466.4991 500.2942 552.1952 568.1643 639.8374 690.0776 703.7001 736.1371 751.3372 837.3137 893.3421 901.3171 918.8674 924.4836 1004.1885 1023.3256 1132.6307 1146.7152 1170.3520 1207.0081 1259.2183 1289.1605 1351.5481 1368.8018 1408.6785 1478.9591 1546.6605 1608.6476 3037.9498 3106.8305 3242.8296 3261.3538
redmass: 4.2973 5.2700 9.1635 12.5084 6.7578 10.4054 14.7510 6.6259 10.0503 8.5566 9.4311 3.0533 8.8192 5.6238 3.6889 8.2421 8.4803 11.2965 7.5840 1.2803 7.9437 1.9205 6.6548 1.4536 3.2349 1.3586 5.6513 1.1023 4.5328 1.8551 3.9095 1.9627 5.2257 7.3445 1.0925 9.4142 6.6182 10.1631 1.0576 1.1053 1.0958 1.1044
irintensity: 3.3245 7.3483 7.3608 5.0179 1.3744 0.6035 1.4636 0.5336 4.8920 1.1661 3.2116 1.0692 0.2655 1.6317 0.3826 9.3560 61.5430 41.0396 11.6007 70.7593 14.7613 1.3099 8.0010 0.4164 20.3138 40.5300 7.2772 1.0748 148.9973 257.3714 66.2925 31.8163 15.3427 123.9126 34.7749 11.1038 58.5473 83.3963 18.3110 0.6735 1.9844 7.9731
temp: 298.150 k
press: 1.00000 atm
elementType: 17 8 8 8 8 7 6 6 6 6 6 6 1 1 1 1
symmnumber: 1
zpe: 253818.8 jmol-1
zpe.correction: 0.096674 hartree
zpe.thermalcorrener: 0.107679 hartree
zpe.thermalcorrenthalpy: 0.108624 hartree
zpe.thermalcorrgfe: 0.057212 hartree
zpe.sumelectzpe: -1045.741054 hartree
zpe.sumelectthermal: -1045.730049 hartree
zpe.sumelectthermalent: -1045.729105 hartree
zpe.sumelectthermalfe: -1045.780517 hartree
dipole: 0.9640 2.3352 0.0035
dipole: 2.5263
quadrupole: -100.6911 -75.1648 -72.6261
quadrupole: 13.9672 -0.0067 -0.0014
quadrupole: -17.8638 7.6626 10.2012 13.9672 -0.0067 -0.0014
hfenergy: -1045.8377285 hartree
pointgroup: C01 [X(C6H4Cl1N1O4)]
dipole: 0.2853042 -0.9521104 0.0004772 debye
dipolederiv: -0.4543357 0.1616073 -0.0002041 0.1183426 -0.1409003 0.0000189 0.000159 -0.0001806 -0.1264549 -0.1041717 0.1127188 -0.0002234 0.1190201 -0.5857168 0.0009563 -0.0001688 0.0010339 -0.0611935 -0.8561246 -0.104572 0.0002497 -0.2128789 -0.5930107 0.0009419 0.0000093 0.0006431 -0.2746324 -0.9359855 0.0658343 -0.0003627 0.0929411 -0.4713705 0.0005229 -0.0003323 0.0004819 -0.2209625 -0.4653357 -0.0289489 -0.0000174 -0.1634534 -0.7834222 0.001025 0.0002227 0.0011316 -0.2038114 1.7555376 0.2642167 -0.0000261 0.5053538 1.3091624 -0.0019469 -0.0004911 -0.0020185 0.20871 -0.6248273 0.0699126 -0.0003685 0.2665583 0.1074385 -0.0000336 -0.0005873 -0.00018 0.0229388 -0.1487298 0.0516288 -0.0001054 0.0977391 0.0852545 -0.0003206 -0.0001094 -0.0003297 -0.1113077 -0.4953867 -0.3442783 0.000423 -0.5980201 -0.0477949 0.0001721 0.0008961 0.0001975 0.1079621 0.1236655 -0.0031674 0.0000649 0.1305577 0.0464064 -0.000255 -0.0002316 -0.000313 -0.1171077 1.4806597 -0.0468114 0.000512 -0.4633305 0.933002 -0.0022809 0.00188 -0.0022038 0.1615882 0.6590014 -0.2175301 0.0000786 0.0833855 -0.2966967 0.0015433 -0.0015414 0.0021763 0.1556801 0.1038236 -0.0465705 0.0000634 -0.032452 0.1032841 0.0001399 0.000036 0.0001608 0.1900805 0.0796775 0.0297091 -0.0000884 0.0097239 0.1435435 0.0001048 -0.0000454 0.0000965 0.2026172 -0.0588159 0.0177976 -0.067266 0.0229725 0.0952712 -0.0227 -0.0683483 -0.0320363 0.0332905 -0.0586521 0.0184534 0.0672707 0.0235403 0.0955496 0.0221119 0.0686525 0.0313405 0.0326027 unknown
polarizability: 167.618195|1.9282436|101.854563|0.0163334|-0.1186979|39.8309825 unknown
InChI: InChI=1S/C6H4ClNO4/c7-3-4(9)5-1-2-6(12-5)8(10)11/h1-2H,3H2
charge 0 multiplicity 1
16 atoms
Cl -4.249974 1.50331 -0.004323
O  0.284854 0.423765 -0.001729
O  -2.944711 -1.234894 0.000621
O  3.844422 0.054498 -0.000124
O  2.531655 1.944157 -0.004105
N  2.7020 0.666161 -0.001537
C  -0.652274 -0.638186 0.00001
C  0.024679 -1.86191 0.002308
C  1.536421 -0.18616 -0.000294
C  1.428254 -1.574202 0.002186
C  -2.095964 -0.307237 -0.000787
C  -2.425746 1.186567 -0.005258
H  -0.456023 -2.837394 0.003931
H  2.259471 -2.274216 0.003683
H  -2.000619 1.677022 0.886022
H  -2.002745 1.670817 -0.901004
