program: Gaussian 09
title: 000230093
version: EM64L-G09RevD.01
frameworkgroup: C1[X(C5H10OS)]
method: RPBEPBE
basis: SDD
operation: Freq
keyword: #p
keyword: freq=noraman
keyword: PBEPBE/SDD
title: #p freq=noraman PBEPBE/SDD
converged: YES YES NO NO
title: Mulliken charges:
elementType: S O C C C C C H H H H H H H H H H
charge: -0.035779 -0.450453 -0.536805 -0.035818 -0.375203 -0.450381 -0.421242 0.269817 0.218570 0.233107 0.234003 0.222350 0.244310 0.218842 0.218149 0.108973 0.337561
chargesum: 0.00000
title: Mulliken charges with hydrogens summed into heavy atoms:
elementType: S O C C C C C
charge: 0.073193 -0.112892 -0.266988 0.182752 0.091907 0.016279 0.015748
polarizability: 8.73549405e+01 -2.06487075e+00 6.26265815e+01 3.32862730e-01 2.57423160e+00 6.17742600e+01
1716.lowfreq: -25.2717 -6.1650 -0.0025 -0.0003 0.0015 14.1681 51.5715 138.3134 206.4973
frequency: 49.1360 138.2620 206.3485 217.1648 276.6317 342.7899 410.7325 491.3444 586.7820 679.3538 746.5577 771.9261 813.2844 846.2013 884.7609 898.6218 960.3552 991.2384 996.1553 1058.6384 1114.0675 1145.1625 1178.4766 1192.6689 1231.2125 1233.3699 1271.7296 1288.0991 1307.3054 1309.5258 1328.7462 1355.5545 1454.1556 1459.8249 1481.4748 2424.0127 2965.2979 3005.3303 3016.9452 3025.8947 3040.4888 3066.7986 3088.8061 3099.1431 3427.6501
redmass: 1.8616 2.9369 1.0683 6.2879 3.5258 4.1713 3.4128 1.1052 2.3080 2.8655 2.6714 1.8935 1.3728 2.2076 2.6127 2.3314 1.9065 1.8237 1.8173 2.7010 2.9620 1.2742 1.3074 1.2661 1.2225 1.2014 1.2780 1.2719 1.1926 1.4730 1.3404 1.5421 1.0791 1.0857 1.0923 1.0383 1.0853 1.0618 1.0615 1.0658 1.0859 1.1005 1.1032 1.1040 1.0646
irintensity: 0.7331 3.2098 15.7982 2.3530 2.8182 8.6740 21.8571 132.8192 6.7048 5.1639 6.1405 10.5864 5.7892 11.0919 6.1927 1.2981 1.3951 21.9615 21.5141 8.8747 1.6286 17.5021 11.5610 23.2787 3.1116 6.0055 2.7894 27.4003 18.4530 4.1121 6.9983 27.9878 6.2778 9.8289 7.1534 27.0641 58.1257 33.4547 35.3380 32.9936 25.8606 9.5107 6.3725 58.3138 28.3106
temp: 298.150 k
press: 1.00000 atm
elementType: 16 8 6 6 6 6 6 1 1 1 1 1 1 1 1 1 1
symmnumber: 1
zpe: 370112.8 jmol-1
zpe.correction: 0.140969 hartree
zpe.thermalcorrener: 0.148798 hartree
zpe.thermalcorrenthalpy: 0.149742 hartree
zpe.thermalcorrgfe: 0.108279 hartree
zpe.sumelectzpe: -669.225057 hartree
zpe.sumelectthermal: -669.217227 hartree
zpe.sumelectthermalent: -669.216283 hartree
zpe.sumelectthermalfe: -669.257747 hartree
dipole: 0.2035 -0.9994 2.1798
dipole: 2.4066
quadrupole: -50.3410 -54.4962 -49.1480
quadrupole: -4.5750 -1.0868 2.2487
quadrupole: 0.9874 -3.1678 2.1804 -4.5750 -1.0868 2.2487
hfenergy: -669.3660254 hartree
pointgroup: C01 [X(C5H10O1S1)]
dipole: 0.0824958 -0.4694685 0.8181099 debye
dipolederiv: -0.3738473 -0.0631772 0.0119685 -0.0445572 -0.2656931 0.1447052 0.0417161 0.1069262 0.100569 -0.3470779 0.0068496 -0.0564828 0.0533339 -0.7230693 0.1098641 -0.1073981 0.0617712 -0.5937486 0.529014 -0.0836629 0.0640386 -0.0942575 0.0428562 -0.0387792 -0.071581 -0.0231988 0.0371457 0.1680918 -0.0811651 0.0687496 0.0491701 0.3805151 -0.0364627 0.0898424 -0.0738816 0.496575 -0.0686554 0.0339441 0.0383247 -0.0574025 0.0772425 -0.0927097 -0.0754075 -0.0021096 0.0549179 -0.1031643 0.0408311 0.0016425 -0.0433579 0.0091566 -0.0371241 0.0871379 -0.0030604 0.1203535 0.0335505 -0.0163773 -0.0223073 -0.0348837 0.0861569 -0.0645257 0.0389777 -0.1016569 0.1084468 -0.04017 0.0308106 -0.0317888 0.0155501 -0.0068624 0.0646134 -0.0212776 0.0700299 -0.1047136 0.0070258 0.0519148 0.0599148 0.0357603 -0.0604027 -0.0872515 0.0161977 -0.0730233 -0.2048771 0.0388625 0.0097725 -0.0604844 0.0258225 0.0733223 0.0911628 -0.0419754 0.0343711 -0.070525 0.0455008 -0.0649094 -0.0105885 -0.0465956 -0.1513931 -0.0292293 0.0020347 -0.0027047 0.0782899 0.0312664 0.010226 -0.074928 0.0257265 0.0495313 0.0084351 -0.1284378 -0.0265866 -0.1307252 -0.0063462 -0.0797417 0.0297616 -0.0755134 -0.0287528 0.0343959 0.0720823 0.0564658 0.0519411 -0.0583846 0.0299973 0.1063141 -0.0043275 0.0614465 -0.0098099 0.1316709 -0.0394291 -0.0722265 0.0137167 0.0467089 -0.0424567 0.0822793 -0.0811198 0.0743078 -0.0952611 0.11485 -0.0205945 0.0022424 0.0278839 -0.0307989 0.0753614 0.1035077 -0.1037859 0.0606529 -0.1011605 -0.1226462 0.1283747 0.1000946 -0.050879 0.0378912 0.433558 -0.0278065 0.0010259 0.0023974 0.2718178 unknown
polarizability: 87.3304018|-2.2186901|62.1823748|0.0002879|2.6222268|62.2430054 unknown
InChI: InChI=1S/C5H10OS/c6-4-2-1-3-5(4)7/h4-7H,1-3H2
charge 0 multiplicity 1
17 atoms
S  -2.503311 -0.207027 -0.008335
O  -0.153437 1.756687 -0.595458
C  -0.675343 -0.43401 0.4765
C  0.11614 0.898694 0.563805
C  0.088144 -1.245947 -0.591466
C  1.592442 0.444836 0.464893
C  1.580024 -0.951489 -0.251971
H  -0.654543 -0.951888 1.451918
H  -0.107312 1.447194 1.502901
H  -0.156376 -0.856276 -1.596306
H  -0.159571 -2.320106 -0.56294
H  2.045236 0.375529 1.470059
H  2.149961 1.205706 -0.105495
H  2.203404 -0.950887 -1.161986
H  1.980376 -1.732891 0.419868
H  -2.928946 0.295748 1.21257
H  -1.136789 1.723425 -0.765459
