program: Gaussian 09
title: 000230092
version: EM64L-G09RevD.01
frameworkgroup: C1[X(C12H12N2O3S)]
method: RPBEPBE
basis: SDD
operation: Freq
keyword: #p
keyword: freq=noraman
keyword: PBEPBE/SDD
title: #p freq=noraman PBEPBE/SDD
converged: NO YES NO NO
title: Mulliken charges:
elementType: S O O O N N C C C C C C C C C C C C H H H H H H H H H H H H
charge: 0.213034 -0.429115 -0.292692 -0.225194 -0.409794 -0.058285 -0.100783 -0.714640 0.184898 0.165304 0.266644 -0.347706 -0.349478 -0.694808 -0.223495 -0.238522 -0.224798 -0.000200 0.303461 0.325017 0.282226 0.357650 0.274826 0.219036 0.305399 0.298119 0.233500 0.231717 0.233828 0.414851
chargesum: 0.00000
title: Mulliken charges with hydrogens summed into heavy atoms:
elementType: S O O O N N C C C C C C C C C C C C
charge: 0.213034 -0.014265 -0.292692 -0.225194 -0.052144 -0.058285 0.202678 -0.107397 0.184898 0.165304 0.266644 -0.072880 -0.130442 -0.091290 0.010005 -0.006805 0.009030 -0.000200
polarizability: 2.14356122e+02 5.12700554e+00 1.66713206e+02 1.67340043e+01 -6.87183032e+00 1.07500660e+02
1716.lowfreq: -8.9018 -1.9251 -0.0016 0.0010 0.0014 7.3284 24.6467 31.5579 39.0105
frequency: 24.5549 31.4939 38.9743 57.0479 65.3564 79.9412 94.8665 115.4944 143.0420 164.2517 187.0589 212.1633 214.9456 266.7450 316.8437 337.0745 354.5721 400.1243 412.0793 459.2385 468.9515 473.7163 526.9892 546.8842 573.1429 602.8107 614.7168 631.0049 656.5236 666.5888 688.2804 702.6154 734.6390 793.7529 800.0144 832.2693 854.6457 879.8143 914.3845 934.0767 937.8248 974.3140 985.9278 989.8864 1007.4040 1024.4917 1074.2559 1086.9284 1105.1226 1153.8661 1173.9615 1180.1579 1189.7447 1193.5564 1222.8388 1233.5040 1251.2639 1296.9225 1318.9072 1324.5379 1340.0038 1386.6108 1408.0227 1420.5934 1433.5684 1467.2950 1497.2646 1561.3983 1601.9605 1612.4737 1660.1883 2191.7344 2987.7920 3034.8110 3040.0298 3107.7256 3119.3464 3122.0624 3133.7015 3146.9209 3159.4870 3170.8468 3492.4997 3571.8152
redmass: 4.1998 7.6702 7.1404 6.8240 5.7015 8.5224 9.2281 6.8378 5.6595 4.3515 9.1113 5.6610 5.8337 4.7566 6.3232 2.8501 3.2233 2.8216 5.0460 4.6796 10.9250 4.2173 3.5330 2.9618 1.4040 2.8959 6.0846 1.9754 6.6702 5.1150 4.6416 1.5199 4.9707 2.5460 3.3157 2.2589 1.2538 2.4970 3.4732 5.3976 1.4723 2.6653 1.4100 5.6286 1.3434 2.4486 2.2589 1.6672 2.2944 1.7559 1.0598 1.4480 1.1686 1.1432 1.2699 1.2290 1.4924 1.6402 1.3355 1.4616 2.3001 9.1041 1.0915 1.0874 2.2288 2.0369 2.3766 6.8063 6.5513 6.0190 9.2370 12.3754 1.0812 1.0573 1.0580 1.1051 1.1074 1.0872 1.0872 1.0920 1.0958 1.1009 1.0645 1.0778
irintensity: 0.3924 0.3358 5.2076 1.1320 17.0335 1.7913 0.1293 7.9532 1.1877 1.6343 13.0666 2.4035 4.3825 2.3762 6.1371 1.2631 0.1229 0.4493 1.0838 1.4371 0.1427 13.2324 57.0207 29.7804 15.0947 104.6642 2.8568 114.3483 12.1130 20.8894 16.8498 155.3702 12.8528 16.0072 6.1047 13.5168 0.6258 21.2999 5.8048 6.1306 5.3454 36.4107 0.8844 0.8770 1.2037 5.6265 39.8383 21.9857 110.6519 6.2904 0.4343 14.9695 14.6643 6.8913 8.0474 2.8773 36.6340 73.7291 5.8828 40.7892 16.4228 1.7673 10.5228 56.0743 10.3879 263.1982 259.3443 107.0493 30.8808 10.2034 196.7222 14.2044 9.8787 10.5615 6.2510 0.0889 2.1084 8.6494 2.2245 20.3016 14.8824 21.4099 64.6964 38.5580
temp: 298.150 k
press: 1.00000 atm
elementType: 16 8 8 8 7 7 6 6 6 6 6 6 6 6 6 6 6 6 1 1 1 1 1 1 1 1 1 1 1 1
symmnumber: 1
zpe: 581775.4 jmol-1
zpe.correction: 0.221587 hartree
zpe.thermalcorrener: 0.239376 hartree
zpe.thermalcorrenthalpy: 0.240320 hartree
zpe.thermalcorrgfe: 0.173234 hartree
zpe.sumelectzpe: -1196.407907 hartree
zpe.sumelectthermal: -1196.390118 hartree
zpe.sumelectthermalent: -1196.389174 hartree
zpe.sumelectthermalfe: -1196.456260 hartree
dipole: -0.5824 0.5239 -1.6441
dipole: 1.8212
quadrupole: -100.6439 -113.5636 -116.9635
quadrupole: -14.9278 -0.8264 4.2991
quadrupole: 9.7465 -3.1733 -6.5732 -14.9278 -0.8264 4.2991
hfenergy: -1196.629494 hartree
pointgroup: C01 [X(C12H12N2O3S1)]
dipole: 0.1405007 0.6646221 -0.2278601 debye
polarizability: 208.21106|30.227882|113.3826681|4.7644987|-4.6853704|166.9762592 unknown
InChI: InChI=1S/C12H12N2O3S/c13-6-7-18-8-10(12(16)17)14-11(15)9-4-2-1-3-5-9/h1-5,10,14,16H,7-8H2
charge 0 multiplicity 1
30 atoms
S  -2.366711 1.35328 1.073874
O  -1.587624 -1.39171 -1.576165
O  1.410502 -0.760072 2.113529
O  -3.020794 -2.307002 0.014813
N  0.188365 -0.548696 0.162382
N  -4.131375 0.154652 -2.095725
C  -0.972109 -1.195112 0.76702
C  -1.728912 -0.284114 1.780802
C  1.355996 -0.395319 0.891654
C  -1.96002 -1.713355 -0.274594
C  2.532471 0.216638 0.182495
C  3.604732 0.682028 0.985835
C  2.623757 0.326819 -1.230373
C  -4.117096 0.885523 0.459242
C  4.741715 1.265339 0.390699
C  3.764329 0.908207 -1.825342
C  4.823137 1.383638 -1.017056
C  -4.149138 0.496772 -0.95213
H  -0.614683 -2.058671 1.36551
H  -1.019566 0.012889 2.570251
H  -2.573502 -0.831505 2.230561
H  0.087775 -0.199242 -0.79087
H  3.521858 0.567758 2.071543
H  1.832355 -0.064306 -1.881077
H  -4.500082 0.06455 1.088221
H  -4.733627 1.783728 0.628192
H  5.563012 1.625599 1.019511
H  3.830777 0.983261 -2.916058
H  5.70675 1.835415 -1.481236
H  -2.345294 -1.544197 -2.206505
