program: Gaussian 09
title: 000230091
version: EM64L-G09RevD.01
frameworkgroup: C1[X(C11H16N2O3S)]
method: RPBEPBE
basis: SDD
operation: Freq
keyword: #p
keyword: freq=noraman
keyword: PBEPBE/SDD
title: #p freq=noraman PBEPBE/SDD
converged: YES YES NO NO
title: Mulliken charges:
elementType: S O O O N N C C C C C C C C C C C H H H H H H H H H H H H H H H H
charge: 0.909979 -0.497317 -0.548488 -0.229559 -0.113164 0.065751 -0.356551 -0.340001 -0.344314 -0.113460 -0.685240 -0.238597 -0.201804 0.454599 -0.395962 -0.343537 -0.798501 0.246368 0.268600 0.210462 0.217247 0.198792 0.207077 0.222155 0.213578 0.213754 0.291775 0.289499 0.245367 0.245477 0.228482 0.237212 0.240321
chargesum: 0.00000
title: Mulliken charges with hydrogens summed into heavy atoms:
elementType: S O O O N N C C C C C C C C C C C
charge: 0.909979 -0.497317 -0.548488 -0.229559 -0.113164 0.065751 0.158416 0.087709 0.061556 -0.113460 -0.035752 0.053178 0.087695 0.454599 -0.150595 -0.098061 -0.092486
polarizability: 2.32599843e+02 1.48043886e+01 1.60519783e+02 3.59555363e+00 -1.09584316e+01 1.71737288e+02
1716.lowfreq: -8.7420 -4.7864 -0.0012 0.0013 0.0017 5.0308 13.4991 30.2137 37.7553
frequency: 13.1306 29.5839 37.7415 46.5445 51.0083 63.1423 83.7438 91.2416 100.8940 114.2773 117.7636 141.8469 169.7848 214.6982 219.7259 229.4216 270.9812 296.3419 313.3460 356.6669 359.7994 375.5275 397.4390 406.7921 430.1911 467.5272 508.4069 578.8762 620.5329 659.4978 703.2607 739.5207 775.4055 789.5356 795.2788 818.7510 842.7720 884.2288 899.8887 917.3100 938.7783 957.8385 981.7721 984.5889 995.6216 1019.4151 1048.2586 1049.6786 1068.4057 1108.8078 1120.6026 1151.2438 1186.7306 1208.4669 1217.7120 1225.6785 1267.9204 1288.9046 1293.8680 1298.9860 1346.9016 1356.8670 1379.9491 1389.9207 1392.0097 1402.6754 1423.3952 1466.3439 1469.6237 1470.4759 1470.6578 1476.4253 1477.2032 1477.6894 1487.8952 1589.2678 1593.9510 2972.1597 2975.3865 2977.8085 2983.4368 2991.3648 3015.7918 3034.4908 3060.2697 3062.5308 3076.1170 3079.3341 3093.8136 3135.7993 3139.7664 3159.9687 3164.4793
redmass: 4.1726 3.2048 4.3660 1.3126 1.7621 3.1686 7.4763 6.3835 2.7334 4.4592 8.2469 4.6178 4.6118 6.3922 3.2871 1.2457 5.6655 4.7579 4.0671 8.1489 5.0153 3.5828 4.7717 3.0538 9.3689 4.4869 3.2900 6.0031 6.9592 7.4521 3.2748 1.0765 5.0735 10.7669 1.2370 1.3544 1.2462 3.8101 1.7652 18.0353 1.3431 1.3198 1.4335 2.6568 1.8607 3.8786 2.4269 1.5842 2.6026 2.2711 1.2978 1.7177 1.1307 5.1425 3.0582 1.4508 1.2582 1.0693 1.2004 1.2574 1.4594 1.3591 4.9666 2.9605 1.2127 1.2944 3.6419 1.2690 1.0851 1.0488 2.2914 1.1089 1.0507 1.0687 1.0895 6.5413 6.2166 1.0587 1.0593 1.0371 1.0377 1.0584 1.1000 1.1023 1.1051 1.0974 1.1016 1.0993 1.0989 1.0889 1.0891 1.0958 1.0964
irintensity: 0.5615 1.0811 0.1594 0.7384 0.2064 1.0827 1.5983 1.0596 0.6212 2.8436 2.8437 8.3461 8.9234 8.6333 1.5636 0.7792 1.2418 8.7930 5.9159 13.7710 14.1822 4.5074 2.1751 0.1654 67.9471 1.9967 73.4645 25.8709 0.5627 100.8490 0.8382 8.2281 6.1570 104.3450 1.6489 31.2165 8.9421 93.5549 2.9141 63.3946 29.6508 1.2841 1.2353 0.7204 6.6568 8.4331 20.2146 15.3015 0.9090 22.9658 11.1781 17.1063 22.0152 80.3675 4.5031 33.4838 0.7732 3.8347 40.0649 5.0852 3.5386 15.8244 4.4744 14.5600 11.9105 15.1604 158.9521 61.1344 10.8865 14.0244 24.6211 16.3321 9.6065 14.1973 28.9710 7.7206 2.5745 23.8386 5.9549 31.3355 24.1566 38.9154 4.3036 6.3277 7.0858 15.1298 73.5426 46.5146 17.2841 11.4301 7.4936 2.1250 13.2468
temp: 298.150 k
press: 1.00000 atm
elementType: 16 8 8 8 7 7 6 6 6 6 6 6 6 6 6 6 6 1 1 1 1 1 1 1 1 1 1 1 1 1 1 1 1
symmnumber: 1
zpe: 669546.7 jmol-1
zpe.correction: 0.255017 hartree
zpe.thermalcorrener: 0.275009 hartree
zpe.thermalcorrenthalpy: 0.275953 hartree
zpe.thermalcorrgfe: 0.202730 hartree
zpe.sumelectzpe: -1160.481524 hartree
zpe.sumelectthermal: -1160.461532 hartree
zpe.sumelectthermalent: -1160.460588 hartree
zpe.sumelectthermalfe: -1160.533810 hartree
dipole: 0.3774 5.5586 1.1063
dipole: 5.6802
quadrupole: -81.2768 -116.5206 -119.6166
quadrupole: 7.7015 2.9077 -4.5615
quadrupole: 24.5278 -10.7159 -13.8119 7.7015 2.9077 -4.5615
hfenergy: -1160.7365405 hartree
pointgroup: C01 [X(C11H16N2O3S1)]
dipole: 0.707009 2.0916705 0.3452462 debye
polarizability: 231.8149806|-4.9656699|155.7781738|13.2783028|-10.9074874|177.2637595 unknown
InChI: InChI=1S/C7H7O2S.C4H9N2O/c1-6-2-4-7(5-3-6)10(8)9;1-2-3-4-5-6-7/h2-5H,1H3;2-4H2,1H3
charge 0 multiplicity 1
33 atoms
S  -0.056025 -1.315909 -0.748224
O  -0.084031 -2.930618 -0.518902
O  -0.218115 -0.698049 -2.261567
O  -1.136138 -0.869664 2.389963
N  -1.737527 -0.24847 0.280904
N  -1.908515 -0.269398 1.5681
C  -2.65781 0.447694 -0.642379
C  -2.749246 1.967731 -0.383114
C  -3.684508 2.653004 -1.404856
C  1.543515 -0.599884 -0.033465
C  -3.808086 4.171871 -1.157771
C  2.277854 0.286263 -0.835587
C  1.937594 -0.998366 1.253953
C  3.942614 0.417001 0.981928
C  3.489246 0.791341 -0.309248
C  3.151589 -0.480564 1.751539
C  5.24679 0.957203 1.538706
H  -3.655966 -0.026373 -0.583255
H  -2.237927 0.249641 -1.649335
H  -1.73672 2.411622 -0.444854
H  -3.120271 2.138793 0.646182
H  -4.689835 2.187527 -1.355585
H  -3.304696 2.472799 -2.430413
H  -4.482342 4.642433 -1.895876
H  -4.212408 4.379518 -0.149491
H  -2.823162 4.668978 -1.234678
H  1.921006 0.555067 -1.834966
H  1.318456 -1.677004 1.849664
H  4.087803 1.481571 -0.914213
H  3.486485 -0.774646 2.75289
H  5.720464 1.673138 0.846402
H  5.0869 1.472745 2.503711
H  5.968008 0.139402 1.724239
