program: Gaussian 09
title: 000230088
version: EM64L-G09RevD.01
frameworkgroup: C1[X(C4H5Cl3O3)]
method: RPBEPBE
basis: SDD
operation: Freq
keyword: #p
keyword: freq=noraman
keyword: PBEPBE/SDD
title: #p freq=noraman PBEPBE/SDD
converged: YES YES NO NO
title: Mulliken charges:
elementType: Cl Cl Cl O O O C C C C H H H H H
charge: 0.147787 0.066649 0.102261 -0.380807 -0.409747 -0.224169 0.029540 -0.481754 -0.644153 0.221424 0.315353 0.265700 0.263090 0.343767 0.385061
chargesum: 0.00000
title: Mulliken charges with hydrogens summed into heavy atoms:
elementType: Cl Cl Cl O O O C C C C
charge: 0.147787 0.066649 0.102261 -0.037041 -0.024686 -0.224169 0.344892 0.047036 -0.644153 0.221424
polarizability: 8.79704750e+01 -8.90263280e-01 7.61263757e+01 -4.70794982e+00 -2.47659400e+00 8.14726153e+01
1716.lowfreq: -6.2577 -3.9796 -0.0035 -0.0032 -0.0021 3.3152 33.2743 55.1178 72.5487
frequency: 33.2304 55.0610 72.5446 124.8036 180.3142 182.1125 213.6575 247.4856 268.3971 330.9034 353.9154 380.6581 394.0492 486.9094 526.7183 529.7483 622.6313 669.6679 725.1661 746.4942 867.0813 889.2121 965.0602 1036.9039 1063.0688 1097.0708 1164.4170 1253.9786 1277.8888 1292.4597 1365.6300 1382.4693 1441.1350 1670.8366 3017.7099 3066.5566 3098.2138 3510.5124 3515.3103
redmass: 7.7623 7.3692 8.1792 6.9317 9.8661 12.9648 12.7124 11.2165 16.9889 7.2831 2.6830 1.7374 3.5196 3.7797 3.0628 3.7736 2.5874 1.7350 8.7850 9.2697 3.1241 5.1620 2.7325 4.9844 2.2563 3.3426 1.1752 1.3259 1.3846 1.5558 1.6959 1.1815 1.0849 8.7891 1.0623 1.0860 1.0978 1.0639 1.0656
irintensity: 0.8818 2.1418 0.4696 2.3123 1.1363 0.6240 0.3766 2.1006 0.8068 10.0403 34.7367 93.3970 20.5032 47.5869 41.2647 125.2598 70.7170 86.3084 112.7475 134.3783 15.1576 4.0704 52.3241 52.1945 268.6326 26.4535 24.6835 25.4498 35.3421 41.6602 68.3633 31.3012 21.1970 206.6002 5.1444 10.4809 2.4983 30.6143 12.5064
temp: 298.150 k
press: 1.00000 atm
elementType: 17 17 17 8 8 8 6 6 6 6 1 1 1 1 1
symmnumber: 1
zpe: 239970.8 jmol-1
zpe.correction: 0.091400 hartree
zpe.thermalcorrener: 0.102901 hartree
zpe.thermalcorrenthalpy: 0.103845 hartree
zpe.thermalcorrgfe: 0.051994 hartree
zpe.sumelectzpe: -1760.477335 hartree
zpe.sumelectthermal: -1760.465834 hartree
zpe.sumelectthermalent: -1760.464889 hartree
zpe.sumelectthermalfe: -1760.516741 hartree
dipole: -1.5170 0.1247 2.3056
dipole: 2.7627
quadrupole: -74.0155 -78.2311 -83.9660
quadrupole: -0.2466 -5.1039 -2.5069
quadrupole: 4.7220 0.5065 -5.2285 -0.2466 -5.1039 -2.5069
hfenergy: -1760.5687348 hartree
pointgroup: C01 [X(C4H5Cl3O3)]
dipole: -0.5801813 0.7157208 0.5766725 debye
dipolederiv: -0.4363901 0.3213718 0.0671754 0.3187328 -0.4737915 -0.0847479 0.049137 -0.0850619 -0.1366825 -0.2559028 -0.0599089 -0.0770216 -0.0585485 -0.2925595 -0.2267205 -0.084541 -0.2459132 -0.67094 -0.2125151 -0.0408209 0.0511626 -0.017835 -0.4609513 0.3489138 0.0350666 0.3384912 -0.5133888 -0.6793934 -0.0338516 0.1218909 0.0453661 -0.4620397 0.3119841 0.1006498 0.3398782 -0.394919 -0.9144749 0.3257414 0.4530466 0.2387817 -0.4665882 -0.1155223 0.4181847 -0.1339653 -0.6362602 -0.6970865 -0.1123452 -0.136286 0.0075096 -0.5301899 -0.3026393 0.0546993 -0.2828241 -0.7004589 0.4490183 0.0551042 -0.0887066 -0.0519579 0.2424458 -0.25079 -0.1693462 -0.2713715 0.1589619 -0.4967618 -0.0000106 -0.0109366 -0.1952217 -0.1134432 0.003083 0.0366132 -0.0541603 0.0508186 0.7659675 -0.2782496 0.0215051 -0.226888 1.2243316 0.0304736 -0.0048128 0.0251756 1.3583213 1.528661 -0.0539043 -0.1965528 0.0390372 0.6166603 0.5474449 -0.2980749 0.5323118 0.9809099 0.1037887 -0.0283364 -0.0282559 0.0035077 0.0561182 -0.0275155 0.0725365 0.0211666 0.0213166 0.0767034 0.0072808 -0.0350353 0.0235969 0.0990467 -0.021195 -0.0186891 -0.0519517 -0.0336948 0.1428986 -0.0237406 -0.003158 0.0125785 0.037165 0.0550603 -0.043054 0.0779964 0.0473071 0.4045854 -0.0004068 -0.0622809 -0.0270791 0.2072514 -0.1840963 -0.0492575 -0.1211279 0.1782225 0.2209016 -0.0779234 -0.0765469 -0.1115802 0.3165443 -0.083733 -0.0991116 -0.088644 0.2904863 unknown
polarizability: 87.7947156|-4.2233298|76.7388766|-2.5210354|3.0028294|81.0358739 unknown
InChI: InChI=1S/C4H5Cl3O3/c5-4(6,7)2(8)1-3(9)10/h2,8-9H,1H2
charge 0 multiplicity 1
15 atoms
Cl 2.8588 -1.256905 -0.427993
Cl 2.072913 0.947514 1.49709
Cl 1.868525 1.377541 -1.514356
O  0.071419 -1.469312 0.879477
O  -3.201892 0.669328 0.607482
O  -2.498018 -0.599158 -1.20838
C  0.204218 -0.414074 -0.112939
C  -0.849561 0.695159 0.100104
C  1.661229 0.122725 -0.148405
C  -2.227636 0.163342 -0.257735
H  0.017358 -0.917103 -1.078123
H  -0.844669 1.068554 1.136888
H  -0.64602 1.554273 -0.566776
H  0.246637 -1.093942 1.783535
H  -4.097603 0.331259 0.331732
