program: Gaussian 09
title: 000230086
version: EM64L-G09RevD.01
frameworkgroup: C1[X(C16H17NO2)]
method: RPBEPBE
basis: SDD
operation: Freq
keyword: #p
keyword: freq=noraman
keyword: PBEPBE/SDD
title: #p freq=noraman PBEPBE/SDD
converged: YES YES NO NO
title: Mulliken charges:
elementType: O O N C C C C C C C C C C C C C C C C H H H H H H H H H H H H H H H H H
charge: -0.303998 -0.296656 -0.400604 -0.354237 0.498024 0.381928 -0.384298 -0.372067 -0.423659 -0.419114 -0.236239 -0.238300 -0.230785 -0.224254 0.294840 -0.243942 -0.247295 -0.254674 -0.662251 0.269072 0.326503 0.251435 0.252480 0.252257 0.257474 0.226787 0.226893 0.227955 0.226013 0.229801 0.229317 0.218186 0.236105 0.213257 0.249497 0.224548
chargesum: 0.00000
title: Mulliken charges with hydrogens summed into heavy atoms:
elementType: O O N C C C C C C C C C C C C C C C C
charge: -0.303998 -0.296656 -0.074100 -0.085165 0.498024 0.381928 -0.132863 -0.119586 -0.171402 -0.161640 -0.009452 -0.011407 -0.002830 0.001758 0.294840 -0.014141 -0.017978 0.199617 0.025050
polarizability: 2.04654459e+02 -7.00952361e+00 2.05258353e+02 -1.30539141e+01 1.04085867e+01 1.30687789e+02
1716.lowfreq: -10.2780 -6.0047 0.0006 0.0007 0.0007 5.2053 9.1967 24.3762 40.0919
frequency: 3.7888 24.0268 40.0543 42.8722 64.1252 74.5129 78.2811 88.1588 168.1025 208.8557 217.2562 228.2761 258.9551 298.9499 315.2171 323.3453 401.6182 403.4185 406.3439 452.5834 491.3184 559.1493 575.3889 612.1844 615.4557 618.3789 624.2623 664.4611 698.4689 706.3502 707.9748 741.9449 773.3730 790.7213 811.2823 853.4218 857.2340 863.1428 871.2280 925.7275 935.4135 964.5125 980.8564 986.2094 990.3730 991.4097 998.0803 999.6888 1018.0850 1027.6669 1029.3051 1076.2939 1083.2893 1095.5667 1107.1634 1154.9276 1172.2344 1173.2353 1186.6657 1189.4696 1193.1660 1193.9283 1216.4990 1267.6268 1282.1883 1305.1325 1322.4705 1341.8776 1358.1288 1380.8227 1384.3776 1389.1312 1435.0017 1444.5366 1455.0784 1461.4100 1475.7637 1481.2357 1483.2550 1484.6777 1589.9137 1595.0341 1611.5470 1614.0549 1655.4845 2990.6030 3005.6118 3027.3719 3085.8539 3090.0035 3116.2237 3117.2878 3122.4649 3122.7874 3129.6068 3134.3951 3142.0009 3145.5486 3150.0091 3162.9313 3164.2093 3554.4506
redmass: 4.0503 4.0034 3.3016 3.9648 6.0408 4.5576 4.1672 4.1074 2.4799 4.6877 1.8444 3.0279 4.1294 4.7489 3.2303 4.6683 2.8748 3.3932 2.8697 3.5565 3.3604 1.8014 2.5418 3.8591 5.8574 5.3102 4.4490 4.5542 6.2664 2.2541 1.8318 1.8454 1.9551 1.9438 1.5651 3.6708 1.2696 1.2522 3.1577 1.5365 1.5223 3.3158 1.4337 1.5203 4.6428 4.9258 1.3217 1.3213 3.4120 2.2947 2.2366 1.9837 1.6088 2.1545 3.5441 1.6769 1.0521 1.0601 1.4617 1.2455 1.5166 2.3275 2.3484 1.5702 1.1095 1.3737 1.3169 1.2968 1.2555 7.4612 6.0278 1.2362 2.2274 2.1402 1.1099 1.0526 1.6626 2.2391 1.8417 1.2284 6.0744 6.2019 6.0133 6.0781 8.9589 1.0360 1.0822 1.0594 1.0975 1.1032 1.1057 1.0864 1.0845 1.0871 1.0875 1.0916 1.0920 1.0960 1.0958 1.1015 1.1015 1.0771
irintensity: 0.3314 0.0658 1.0475 0.4026 7.3754 0.7428 1.7835 0.5019 0.4457 0.0603 5.1820 2.0846 1.4015 0.7454 25.6737 0.9869 0.5967 3.8949 0.1340 5.4609 4.6025 77.7700 29.3871 56.5450 6.7125 20.2204 22.0598 4.1607 15.2592 46.5587 62.2884 44.7849 46.4385 17.0680 2.1820 16.8351 1.6796 0.8065 15.6591 14.8519 1.3885 24.9987 0.2157 0.2792 0.9886 0.6370 0.8425 0.3274 135.5567 22.1340 6.7762 37.2507 6.7089 29.4198 71.0870 51.8111 0.4513 0.2301 56.4686 48.7423 77.4789 78.7108 8.6084 9.0285 3.5299 73.9249 18.7044 9.4075 0.4122 0.8458 0.4836 27.6290 8.3368 10.3520 13.1302 15.3675 319.2141 17.6136 16.9096 96.0057 4.6188 0.4662 7.2351 7.8269 258.7095 20.9746 9.7667 37.8131 40.8142 2.0368 35.4744 6.3447 1.5266 0.6520 1.6477 11.7604 18.8834 33.2368 35.0589 29.2036 20.2884 26.3224
temp: 298.150 k
press: 1.00000 atm
elementType: 8 8 7 6 6 6 6 6 6 6 6 6 6 6 6 6 6 6 6 1 1 1 1 1 1 1 1 1 1 1 1 1 1 1 1 1
symmnumber: 1
zpe: 767430.5 jmol-1
zpe.correction: 0.292299 hartree
zpe.thermalcorrener: 0.309971 hartree
zpe.thermalcorrenthalpy: 0.310915 hartree
zpe.thermalcorrgfe: 0.241920 hartree
zpe.sumelectzpe: -823.748467 hartree
zpe.sumelectthermal: -823.730795 hartree
zpe.sumelectthermalent: -823.729851 hartree
zpe.sumelectthermalfe: -823.798846 hartree
dipole: 0.3222 0.5853 -1.9525
dipole: 2.0637
quadrupole: -99.0492 -101.1797 -114.3042
quadrupole: 0.8080 1.4724 3.7999
quadrupole: 5.7952 3.6646 -9.4598 0.8080 1.4724 3.7999
hfenergy: -824.0407659 hartree
pointgroup: C01 [X(C16H17N1O2)]
dipole: -0.2477395 -0.0832802 -0.7686979 debye
polarizability: 198.2247587|-1.957505|212.7313175|3.416202|-13.4743287|129.6445244 unknown
InChI: InChI=1S/C16H17NO2/c1-2-19-16(18)17-15(13-9-5-3-6-10-13)14-11-7-4-8-12-14/h3-12,15,17H,2H2,1H3
charge 0 multiplicity 1
36 atoms
O  3.372294 -0.482645 -0.863486
O  2.567732 -0.635866 1.354609
N  1.241102 0.161998 -0.416038
C  0.000682 0.314464 0.372943
C  -0.958959 -0.850506 0.076812
C  -0.615005 1.713557 0.1999
C  -1.781761 -0.856591 -1.078583
C  -1.960499 1.950753 0.584324
C  -0.971141 -1.979258 0.932735
C  0.162622 2.805821 -0.257563
C  -2.595265 -1.971935 -1.374531
C  -2.515103 3.246539 0.506063
C  -1.788917 -3.094771 0.642021
C  -0.393452 4.102921 -0.343489
C  2.39323 -0.348532 0.140148
C  -2.602552 -3.095238 -0.514155
C  -1.734949 4.329406 0.037431
C  4.667834 -1.069301 -0.417719
C  4.616815 -2.599502 -0.449664
H  0.329498 0.216716 1.426182
H  1.206212 0.260586 -1.432335
H  -1.797148 0.018438 -1.740037
H  -2.574999 1.11819 0.944759
H  -0.330033 -1.985376 1.822652
H  1.209275 2.640303 -0.534793
H  -3.2258 -1.964968 -2.270916
H  -3.555212 3.411113 0.80957
H  -1.790865 -3.959655 1.314842
H  0.223261 4.935179 -0.701552
H  -3.237011 -3.959259 -0.741672
H  -2.166192 5.334695 -0.026547
H  5.397379 -0.664165 -1.137685
H  4.890662 -0.69874 0.598338
H  5.610007 -3.0132 -0.192509
H  3.885524 -2.978359 0.284084
H  4.33933 -2.964311 -1.453837
