program: Gaussian 09
title: 000230066
version: EM64L-G09RevD.01
frameworkgroup: C1[X(C22H22N6O2)]
method: RPBEPBE
basis: SDD
operation: Freq
keyword: #p
keyword: freq=noraman
keyword: PBEPBE/SDD
title: #p freq=noraman PBEPBE/SDD
converged: YES YES NO NO
title: Mulliken charges:
elementType: O O N N N N N N C C C C C C C C C C C C C C C C C C C C C C H H H H H H H H H H H H H H H H H H H H H H
charge: -0.469177 -0.512943 -0.042742 0.015828 -0.347265 -0.031063 -0.302993 -0.340058 -0.141055 -0.002164 -0.009796 -0.096333 0.248465 0.304146 0.301605 0.064477 -0.416164 -0.371865 -0.393382 -0.365724 -0.369160 -0.414365 -0.318628 -0.224939 -0.234465 -0.231245 -0.237580 -0.264749 -0.241062 -0.238467 0.343085 0.226668 0.259361 0.258662 0.249954 0.332501 0.259806 0.272608 0.210499 0.243647 0.205883 0.218393 0.230806 0.228377 0.230173 0.229833 0.198280 0.207460 0.231619 0.230997 0.381366 0.432884
chargesum: 0.00000
title: Mulliken charges with hydrogens summed into heavy atoms:
elementType: O O N N N N N N C C C C C C C C C C C C C C C C C C C C C C
charge: -0.087810 -0.080059 -0.042742 0.015828 -0.004180 -0.031063 -0.302993 -0.007556 -0.141055 -0.002164 -0.009796 -0.096333 0.248465 0.304146 0.301605 0.064477 0.069864 -0.113202 -0.143428 -0.105918 -0.096552 0.039780 0.105648 0.005868 -0.006088 -0.001072 -0.007747 0.140992 -0.009443 -0.007471
polarizability: 5.30919222e+02 1.81830858e+01 3.42229496e+02 5.82682252e-01 2.11298905e+01 1.63097580e+02
1716.lowfreq: -3.9853 -0.0008 0.0000 0.0008 2.2935 4.0880 19.7356 33.0301 46.3342
frequency: 19.6778 33.0208 46.3265 48.8407 55.9588 64.1330 69.5037 82.3748 86.4117 138.9782 145.6890 156.9603 162.8369 174.0145 175.6525 200.2652 218.0928 227.7203 233.7543 258.2628 281.8522 281.9757 310.5267 345.9522 362.8637 375.2747 401.1622 406.7135 414.6941 427.2991 462.6869 486.0838 498.4486 525.9426 540.3632 553.3168 578.0954 597.8705 604.0876 616.1804 616.5015 634.5398 647.9910 658.6982 680.6664 694.3710 700.9960 702.5489 713.6186 727.1816 744.2857 772.2421 782.6954 787.7474 795.5595 812.7312 816.1196 842.1047 852.2192 853.5613 915.5568 925.7365 932.6611 946.3085 959.3995 977.9864 978.6476 981.4985 985.2743 989.0601 989.7270 997.4143 998.9351 1011.0769 1014.2923 1024.0245 1030.6703 1048.1860 1067.7431 1071.7828 1083.0251 1087.2688 1093.5393 1123.3852 1140.4139 1173.3552 1173.9310 1190.0132 1192.9178 1203.1869 1211.8271 1217.9688 1232.0432 1274.0811 1281.0681 1297.6567 1314.6976 1315.0498 1320.0808 1327.3679 1346.1917 1347.6594 1355.9452 1359.7552 1361.2121 1376.4629 1381.0688 1408.2525 1420.8735 1431.1878 1435.4448 1441.9823 1458.9084 1460.8609 1466.0980 1471.7727 1478.8513 1482.2334 1485.8015 1490.8331 1529.4899 1558.9000 1583.5038 1584.1948 1588.0148 1608.3798 1611.2564 1658.3485 2554.6765 2952.7986 2968.0493 2977.9321 3011.8466 3046.7890 3061.2938 3063.0958 3092.4739 3127.4027 3127.8595 3135.8946 3138.9842 3148.6468 3152.3519 3156.6152 3162.5366 3168.6639 3171.3338 3190.2600 3495.0961 3551.7687
redmass: 5.5084 5.4790 3.9378 4.7889 5.6353 5.8250 4.1783 4.4748 4.2941 4.4486 3.2663 4.8901 4.4462 4.4041 5.2575 5.1680 5.0916 5.7853 5.7096 3.8211 2.9911 5.1771 5.2452 4.7256 3.9052 5.1233 2.8652 2.8565 5.2086 5.3249 5.9837 4.3791 4.3031 4.0264 4.4491 6.1795 2.0892 6.4931 2.1573 6.1309 6.0634 5.6520 3.5128 5.4907 1.4063 3.3750 1.7538 2.4078 6.2570 4.2618 3.5849 2.1144 2.7024 1.1099 1.6897 3.0613 6.0306 3.6283 1.2527 1.2504 3.2202 1.4175 1.4110 3.8328 2.0439 3.6230 1.5119 1.5185 1.9374 5.8394 4.9259 1.3195 1.3241 4.4222 4.7841 2.8647 2.0765 2.3786 2.5522 2.2190 1.6415 1.7743 2.3119 3.1134 4.2264 1.0546 1.0540 1.1146 1.1181 2.6448 1.5487 1.2133 3.7023 1.3965 1.1674 2.8787 1.2256 1.4461 1.6920 2.1318 1.5804 1.6438 2.2765 1.7580 1.7560 7.6286 6.8374 4.3051 2.4244 1.7895 2.1543 2.1877 1.1489 1.1532 1.4380 1.4476 1.0996 2.3821 2.7198 3.4154 3.0750 3.7604 6.0036 5.9430 4.1366 6.0133 6.0952 1.2516 1.0797 1.0672 1.0666 1.0619 1.0627 1.1016 1.0954 1.0973 1.1030 1.0847 1.0850 1.0879 1.0887 1.0925 1.0933 1.0964 1.0959 1.1015 1.1003 1.0684 1.0771 1.0766
irintensity: 0.2746 0.1377 0.0368 0.1783 1.0392 2.5965 2.0779 3.0549 1.5136 0.4766 6.2553 1.3071 0.6139 3.1271 2.2029 1.8953 0.4254 1.8485 0.0701 2.5314 1.0250 1.4598 0.5468 5.9484 11.3768 6.7714 0.0941 1.0576 6.0100 5.1573 1.7464 5.4400 14.1664 3.4984 8.1016 20.6017 61.5545 8.8639 37.3852 2.2682 3.0465 7.6367 2.1864 17.4406 60.5536 33.0185 86.1484 16.5337 5.6550 3.0663 29.2261 50.7020 57.0543 82.7593 3.7520 10.2929 3.6096 2.8163 1.5472 3.6394 9.5299 1.5768 3.3130 11.8455 42.9617 7.1645 3.5775 1.1591 49.5960 1.9716 6.9488 0.1312 0.4677 35.6669 69.7921 29.2135 3.6728 93.6499 12.4268 9.8744 17.3778 14.9609 19.4017 20.0574 44.3952 0.0633 0.4591 2.8050 17.6909 15.4532 3.8273 2.7133 23.0487 15.0663 3.7986 7.9646 2.3009 36.5297 40.2173 53.6952 112.1094 317.5206 21.6486 19.8882 24.3245 10.9422 1.3023 53.4568 135.1224 99.7994 38.6098 11.6810 40.3407 81.0508 81.4729 14.2897 18.6036 76.7772 36.6149 88.2406 169.1625 1011.2686 1.2032 14.8349 362.9116 7.1699 1.6729 143.0659 1995.8204 60.6305 80.8776 55.2896 30.7207 52.6407 53.4287 31.2187 53.5133 1.6011 0.1465 3.2966 7.4131 20.0755 28.2661 26.2567 17.2079 23.9120 21.8241 290.7404 49.6922 93.0662
temp: 298.150 k
press: 1.00000 atm
elementType: 8 8 7 7 7 7 7 7 6 6 6 6 6 6 6 6 6 6 6 6 6 6 6 6 6 6 6 6 6 6 1 1 1 1 1 1 1 1 1 1 1 1 1 1 1 1 1 1 1 1 1 1
symmnumber: 1
zpe: 1078104.2 jmol-1
zpe.correction: 0.410628 hartree
zpe.thermalcorrener: 0.435975 hartree
zpe.thermalcorrenthalpy: 0.436919 hartree
zpe.thermalcorrgfe: 0.354292 hartree
zpe.sumelectzpe: -1328.388162 hartree
zpe.sumelectthermal: -1328.362815 hartree
zpe.sumelectthermalent: -1328.361871 hartree
zpe.sumelectthermalfe: -1328.444498 hartree
dipole: 3.9322 -0.7518 -0.0495
dipole: 4.0038
quadrupole: -174.8668 -161.8824 -175.7738
quadrupole: 28.1244 2.0821 2.9472
quadrupole: -4.0258 8.9586 -4.9328 28.1244 2.0821 2.9472
hfenergy: -1328.7987899 hartree
pointgroup: C01 [X(C22H22N6O2)]
dipole: 1.4840468 -0.5275236 -0.0241538 debye
polarizability: 531.4973297|-10.9279706|343.431873|-14.4739239|-4.2451976|161.3170947 unknown
InChI: InChI=1S/C22H22N6O2/c29-13-11-23-20-19-21(28-22(27-20)24-12-14-30)26-18(16-9-5-2-6-10-16)17(25-19)15-7-3-1-4-8-15/h1-10,23-24,29-30H,11-14H2
charge 0 multiplicity 1
52 atoms
O  -5.66387 3.274556 0.681359
O  -5.733255 0.791718 -0.429375
N  0.323952 0.986539 -0.200104
N  0.424441 -1.833619 0.119857
N  -2.161414 2.256061 -0.186036
N  -1.949221 -1.934957 0.116875
N  -3.242105 0.156769 0.000016
N  -4.273673 -1.956503 0.222011
C  -0.809229 0.24577 -0.037888
C  1.523574 0.343429 -0.22072
C  1.563591 -1.094982 0.043204
C  -0.794343 -1.191205 0.046003
C  -2.108877 0.904797 -0.057176
C  2.703318 1.17715 -0.583992
C  2.820541 -1.853902 0.311804
C  -3.110774 -1.224102 0.110559
C  -3.412779 3.021051 -0.339223
C  3.701695 0.70007 -1.476353
C  2.801693 2.506995 -0.093682
C  3.91237 -1.281136 1.019539
C  2.894515 -3.218158 -0.079982
C  -5.596034 -1.446389 0.64972
C  -4.251973 3.121327 0.979509
C  4.776888 1.53063 -1.855847
C  3.883319 3.332829 -0.465542
C  5.057114 -2.052537 1.310091
C  4.046326 -3.982343 0.197246
C  -6.332252 -0.536744 -0.363456
C  4.876997 2.847308 -1.347907
C  5.134003 -3.401833 0.892052
H  -1.244891 2.711289 -0.256057
H  -3.151255 4.02634 -0.708886
H  -4.041562 2.539356 -1.11109
H  3.63115 -0.31436 -1.881668
H  2.023759 2.880001 0.580686
H  -4.104892 -2.963933 0.258733
H  3.863847 -0.241245 1.356432
H  2.03184 -3.661723 -0.586479
H  -6.220388 -2.334982 0.853113
H  -5.49254 -0.882253 1.599445
H  -4.053029 2.22102 1.599274
H  -3.957628 4.012085 1.559295
H  5.534494 1.151577 -2.550459
H  3.951526 4.35221 -0.069626
H  5.886894 -1.601778 1.865403
H  4.093739 -5.02975 -0.120378
H  -6.336779 -1.014914 -1.364893
H  -7.378736 -0.411671 -0.029149
H  5.716549 3.488118 -1.639409
H  6.027953 -3.996082 1.11234
H  -5.976985 2.401942 0.275636
H  -4.703802 0.651161 -0.299122
