program: Gaussian 09
title: 000230060
version: EM64L-G09RevD.01
frameworkgroup: C1[X(C12H18ClN7)]
method: RPBEPBE
basis: SDD
operation: Freq
keyword: #p
keyword: freq=noraman
keyword: PBEPBE/SDD
title: #p freq=noraman PBEPBE/SDD
converged: YES YES NO NO
title: Mulliken charges:
elementType: Cl N N N N N N N C C C C C C C C C C C C H H H H H H H H H H H H H H H H H H
charge: -0.023716 -0.186417 -0.164688 0.016137 -0.015738 -0.124592 -0.053442 0.007279 0.124924 0.147213 0.113986 -0.086598 0.065646 -0.617155 -0.649575 -0.655498 -0.612307 -0.372651 -0.629286 -0.627452 0.204957 0.259927 0.235070 0.268245 0.224705 0.229012 0.223204 0.231404 0.287213 0.205864 0.267708 0.238636 0.218802 0.298754 0.218501 0.219432 0.219025 0.293469
chargesum: 0.00000
title: Mulliken charges with hydrogens summed into heavy atoms:
elementType: Cl N N N N N N N C C C C C C C C C C C C
charge: -0.023716 -0.186417 -0.164688 0.016137 -0.015738 -0.124592 -0.053442 0.007279 0.124924 0.147213 0.113986 -0.086598 0.065646 0.082798 0.072388 0.086324 0.099901 -0.372651 0.106771 0.104474
polarizability: 3.71627408e+02 -1.60782415e+00 2.19629100e+02 1.21184127e+00 -1.37426728e-02 1.09738458e+02
1716.lowfreq: -5.3197 -3.2307 -0.0017 -0.0011 -0.0008 5.8230 29.5926 57.6982 78.2715
frequency: 29.5302 57.6511 78.2691 88.6041 108.6154 115.4658 117.1950 128.1852 135.5527 144.4423 158.4662 164.8480 170.5339 182.5459 195.3120 224.2092 238.1370 247.5379 249.7442 278.6464 295.3963 312.4320 325.5859 343.8508 364.7615 399.9256 417.5594 434.9622 464.3063 484.7406 526.9687 545.4963 563.0438 600.7907 624.2622 673.7835 693.9008 700.2358 747.0020 784.2047 791.1468 803.2799 895.4977 918.6451 966.2850 1022.1630 1051.0891 1052.8858 1057.5347 1088.9732 1091.9062 1098.3211 1107.7184 1136.3981 1139.3443 1148.7629 1150.4168 1184.2520 1193.8630 1219.5553 1221.8763 1252.8178 1282.8169 1320.1319 1346.9649 1374.8962 1382.6677 1413.0315 1413.8455 1414.7084 1419.6236 1425.0101 1427.6812 1441.9545 1447.7164 1451.8718 1459.5798 1465.5639 1469.4988 1472.7866 1476.3185 1477.3057 1483.0099 1492.0348 1493.6826 1497.7581 1521.7938 1532.2185 1549.9328 1579.2132 2943.5147 2952.8876 2956.5719 2961.3190 2963.2100 2970.7383 3028.0693 3030.2509 3038.9173 3043.2001 3055.0236 3059.9250 3108.3927 3110.2393 3121.2445 3124.1552 3127.9296 3130.8002
redmass: 4.6627 3.2341 2.7613 3.2131 1.6077 4.2322 2.3592 2.1228 1.2360 1.5407 3.5760 1.7723 2.6168 1.0943 2.0018 2.5255 2.2124 1.8879 2.3356 3.7029 3.8350 4.1869 5.9929 3.4619 3.1126 3.1697 4.4105 8.7145 3.2436 4.0301 8.1342 5.4293 6.3379 11.8660 9.7368 6.6927 8.4597 11.7342 11.0579 8.2044 11.1993 10.9942 4.8445 5.1278 3.0599 3.2884 1.4915 1.4816 1.3629 1.2456 1.2462 1.2138 2.4710 1.4786 1.4057 1.3654 4.0809 2.8824 3.3964 4.0770 3.6330 6.4731 6.2710 5.0376 6.7676 9.3339 4.5272 1.5534 1.1672 2.8666 1.4177 1.1692 1.1831 1.5607 1.0927 1.0986 1.2884 1.2749 1.0620 1.1092 1.0769 1.0702 1.0455 1.0460 1.0581 1.1659 1.6327 3.7399 3.9294 4.8957 1.0453 1.0419 1.0369 1.0419 1.0380 1.0406 1.1010 1.1014 1.0932 1.0895 1.0927 1.0951 1.0996 1.0993 1.0994 1.0966 1.0991 1.0957
irintensity: 1.0982 3.5239 0.2878 2.1119 0.4160 2.0754 4.6716 0.5487 1.2026 2.8566 2.0942 0.1145 10.2787 0.6777 2.3871 1.7204 1.1407 3.6458 1.0310 9.0192 2.9158 35.9990 12.7151 10.8505 4.3929 0.1166 3.7157 5.4811 2.1464 3.5460 10.9714 1.4067 20.4990 2.4661 9.2675 5.0174 1.9228 4.2598 10.1974 63.5622 9.4852 4.4966 48.4896 35.3987 148.6998 23.0502 5.5975 21.0093 4.5169 9.7922 5.1519 0.0036 62.6259 64.1477 108.9208 0.1047 89.1253 304.7645 10.1829 23.0517 0.6358 6.5621 9.7317 76.4494 6.3704 103.2834 94.7866 358.0400 37.3064 179.1596 23.9806 10.8262 23.8450 23.8789 87.3731 26.6527 189.4819 11.1899 22.6235 22.4171 11.2129 54.9644 0.3598 33.5994 24.4618 5.6461 415.3136 186.6112 14.1064 985.5039 111.7407 121.0263 28.5873 190.1372 184.3600 90.0949 72.5121 10.8308 21.7308 67.2707 34.1578 34.0620 10.0248 1.1935 13.8469 0.9841 9.7987 0.8847
temp: 298.150 k
press: 1.00000 atm
elementType: 17 7 7 7 7 7 7 7 6 6 6 6 6 6 6 6 6 6 6 6 1 1 1 1 1 1 1 1 1 1 1 1 1 1 1 1 1 1
symmnumber: 1
zpe: 791146.9 jmol-1
zpe.correction: 0.301332 hartree
zpe.thermalcorrener: 0.322575 hartree
zpe.thermalcorrenthalpy: 0.323519 hartree
zpe.thermalcorrgfe: 0.251774 hartree
zpe.sumelectzpe: -1309.876133 hartree
zpe.sumelectthermal: -1309.854890 hartree
zpe.sumelectthermalent: -1309.853946 hartree
zpe.sumelectthermalfe: -1309.925691 hartree
dipole: -3.8047 -2.6793 0.4340
dipole: 4.6737
quadrupole: -89.9847 -128.6068 -124.2428
quadrupole: -5.4979 0.9804 2.9632
quadrupole: 24.2934 -14.3287 -9.9647 -5.4979 0.9804 2.9632
hfenergy: -1310.1774651 hartree
pointgroup: C01 [X(C12H18Cl1N7)]
dipole: 1.4153075 -0.9865917 -0.6360608 debye
polarizability: 368.745841|1.7981095|210.4378439|-26.8726969|30.3989255|121.8112814 unknown
InChI: InChI=1S/C12H18ClN7/c1-18(2)10-11(19(3)4)16-9-7(14-10)8(13)15-12(17-9)20(5)6/h1-6H3
charge 0 multiplicity 1
38 atoms
Cl -1.192372 3.112284 1.739362
N  3.297997 1.192966 -0.124757
N  2.87765 -1.793702 -0.39271
N  1.024418 1.312727 0.485737
N  0.578693 -1.378816 -0.312943
N  -4.07563 -0.75837 0.223276
N  -1.758865 -1.079506 -0.109176
N  -2.621074 0.969168 0.916464
C  2.04883 0.562097 0.042879
C  1.833089 -0.882208 -0.220016
C  -0.231898 0.757232 0.535955
C  -0.492261 -0.572508 0.009959
C  -2.780006 -0.292608 0.335483
C  3.415592 2.570566 0.398492
C  4.050037 0.964341 -1.381364
C  4.130552 -1.702119 0.388457
C  2.522907 -3.166098 -0.813018
C  -1.392286 1.449655 0.996986
C  -4.354092 -2.075991 -0.362997
C  -5.228749 0.021215 0.690646
H  4.485408 2.844814 0.415716
H  2.999825 2.621407 1.415683
H  2.858758 3.302866 -0.221651
H  3.90265 -0.066668 -1.737111
H  5.128013 1.131155 -1.207498
H  3.711743 1.660347 -2.178512
H  4.983244 -2.049063 -0.222804
H  4.06684 -2.343827 1.291835
H  4.310513 -0.664836 0.706342
H  3.436214 -3.659269 -1.190265
H  1.755622 -3.130834 -1.599557
H  2.106738 -3.757924 0.026715
H  -4.863158 -2.726764 0.375206
H  -3.402285 -2.536766 -0.662886
H  -5.012123 -1.971701 -1.24794
H  -5.773818 -0.531287 1.481488
H  -5.929276 0.211831 -0.146091
H  -4.874837 0.979298 1.095115
