program: Gaussian 09
title: 000230059
version: EM64L-G09RevD.01
frameworkgroup: C1[X(C10H14N6)]
method: RPBEPBE
basis: SDD
operation: Freq
keyword: #pfreq=noraman
keyword: PBEPBE/SDD
title: #p freq=noraman PBEPBE/SDD
converged: YES YES NO NO
title: Mulliken charges:
elementType: N N N N N N C C C C C C C C C C H H H H H H H H H H H H H H
charge: -0.122859 -0.037719 -0.068364 0.018408 -0.106961 -0.616381 -0.140986 -0.082383 0.098298 0.084985 0.109865 0.130586 -0.779408 -0.773851 -0.630642 -0.627149 0.245269 0.227148 0.227068 0.224153 0.262819 0.224178 0.215690 0.305793 0.216649 0.218267 0.217973 0.286118 0.323872 0.349563
chargesum: 0.00000
title: Mulliken charges with hydrogens summed into heavy atoms:
elementType: N N N N N N C C C C C C C C C C
charge: -0.122859 -0.037719 -0.068364 0.018408 -0.106961 0.057053 -0.140986 -0.082383 0.098298 0.084985 0.109865 0.130586 -0.079922 -0.062701 0.107490 0.095210
polarizability: 2.80529306e+02 1.83138786e+00 1.61611072e+02 3.83410990e-03 5.33059732e-02 7.86505131e+01
1716.lowfreq: -8.0819 -7.8727 -0.0010 -0.0008 -0.0005 8.8579 52.2258 72.1339 93.0000
frequency: 52.2140 72.1207 92.9891 104.6448 118.9017 129.2440 155.4007 159.5757 181.6500 201.5096 233.9503 258.0671 281.8907 287.2407 317.9851 343.6091 364.4760 420.9546 455.0867 465.1069 497.0121 536.8751 553.8388 575.7036 620.5164 620.7718 630.6402 673.9278 696.8284 722.5298 730.7490 818.1800 821.2679 865.8268 964.3826 999.6600 1012.7775 1020.7183 1052.4380 1052.6379 1071.1819 1098.4716 1107.6566 1149.4332 1167.0438 1214.9175 1238.8499 1259.5859 1322.5586 1328.2336 1372.5876 1380.9561 1394.8243 1397.4926 1409.2828 1410.4492 1435.5710 1443.5218 1458.4044 1458.6706 1467.8420 1471.9536 1475.4648 1482.6781 1492.7250 1499.4570 1528.3897 1554.5537 1568.7278 1612.9835 2955.4828 2962.4843 2974.9609 2976.9388 3024.9947 3031.3109 3047.9765 3051.5283 3107.9509 3120.4156 3123.8538 3132.3166 3519.2104 3684.8337
redmass: 3.5992 2.7261 1.1388 2.0903 1.3685 1.1395 1.4376 3.5293 1.7499 4.4621 3.2115 4.2921 2.5058 4.2512 3.3105 3.2625 4.3813 3.4609 3.7138 3.8343 4.2628 1.4942 7.4557 5.6131 4.7432 3.6855 1.1556 6.0833 7.3403 5.6423 7.8568 6.2788 10.7092 4.4237 2.1584 1.8122 2.0089 1.4145 1.6831 1.3762 3.9108 1.2145 2.6075 1.3687 4.1497 2.8265 6.3698 6.4563 8.5904 4.6229 8.7297 1.5051 1.6825 1.9401 1.1493 1.3875 2.2702 1.5487 1.3740 1.0481 1.0614 1.0461 1.2828 1.0458 1.0463 2.8436 3.7800 2.1866 4.0037 2.5487 1.0370 1.0371 1.0382 1.0387 1.1010 1.1012 1.0969 1.0965 1.0979 1.0978 1.0967 1.0953 1.0448 1.1044
irintensity: 2.2772 1.5845 0.8575 5.3737 0.6091 0.2099 0.0032 2.0392 0.7162 3.0228 3.6523 0.9005 0.5456 1.6522 2.2248 5.9844 1.6163 3.3380 14.1005 5.5703 0.2401 204.1114 5.4672 1.9332 1.8404 1.6776 64.2246 0.8946 0.4418 8.4045 15.0439 3.4035 5.0674 9.2903 105.3985 1.6115 3.4424 7.4540 0.0021 7.8138 29.5587 0.0401 66.6298 0.0385 19.1006 106.2598 4.9065 10.3558 122.0442 29.0835 74.5048 74.5644 12.0568 138.2713 21.6106 23.2089 57.9190 33.7748 95.3925 0.1804 12.2659 36.2861 50.4281 1.0236 34.8101 149.1701 38.5460 54.8150 950.4904 460.5540 42.0601 255.7535 34.4585 17.6038 53.9887 32.6237 29.1555 9.5222 12.7127 7.6967 0.9486 1.7992 85.9536 57.1179
temp: 298.150 k
press: 1.00000 atm
elementType: 7 7 7 7 7 7 6 6 6 6 6 6 6 6 6 6 1 1 1 1 1 1 1 1 1 1 1 1 1 1
symmnumber: 1
zpe: 628952.4 jmol-1
zpe.correction: 0.239555 hartree
zpe.thermalcorrener: 0.255429 hartree
zpe.thermalcorrenthalpy: 0.256373 hartree
zpe.thermalcorrgfe: 0.196919 hartree
zpe.sumelectzpe: -716.822094 hartree
zpe.sumelectthermal: -716.806220 hartree
zpe.sumelectthermalent: -716.805276 hartree
zpe.sumelectthermalfe: -716.864730 hartree
dipole: 0.3238 2.6734 0.0085
dipole: 2.6929
quadrupole: -70.2624 -89.3224 -96.1339
quadrupole: 0.1136 -0.0141 -0.0091
quadrupole: 14.9772 -4.0828 -10.8944 0.1136 -0.0141 -0.0091
hfenergy: -717.0616489 hartree
pointgroup: C01[X(C10H14N6)]
dipole: 0.1197333 1.0526913 -0.001121 debye
polarizability: 280.4456235|2.6915653|161.6436866|-3.2028538|-0.1917389|78.7015815 unknown
InChI: InChI=1S/C10H14N6/c1-5-6(2)13-9-7(12-5)8(11)14-10(15-9)16(3)4/h11H2,1-4H3
charge 0 multiplicity 1
30 atoms
N  -3.344718 -0.615836 0.069479
N  1.826323 1.234054 -0.01557
N  -1.050375 -1.124319 0.033166
N  1.282322 -1.57936 -0.002526
N  -1.854548 1.21016 0.040242
N  -0.326161 3.003821 0.01156
C  0.546346 0.744226 0.004753
C  0.238284 -0.660884 0.012494
C  2.838384 0.331506 -0.02965
C  -2.034928 -0.173791 0.046958
C  2.54583 -1.091783 -0.023169
C  -0.584764 1.661384 0.01916
C  4.255787 0.853442 -0.051839
C  3.666909 -2.106349 -0.039317
C  -3.65712 -2.051657 0.080371
C  -4.484457 0.308377 0.086386
H  4.239954 1.954672 -0.054185
H  4.831649 0.510486 0.828994
H  4.805403 0.506237 -0.947615
H  4.330489 -1.990671 0.838937
H  3.235924 -3.11863 -0.031024
H  4.302171 -1.993119 -0.938561
H  -4.246078 -2.309776 0.982381
H  -2.712554 -2.613572 0.080698
H  -4.251165 -2.323848 -0.814332
H  -5.093282 0.153583 0.999313
H  -5.132612 0.135812 -0.795556
H  -4.106221 1.339251 0.068472
H  -1.093196 3.671298 0.022273
H  0.650601 3.29859 -0.003294
