program: Gaussian 09
title: 000230025
version: EM64L-G09RevD.01
frameworkgroup: C1[X(C8H14O2)]
method: RPBEPBE
basis: SDD
operation: Freq
keyword: #pfreq=noraman
keyword: PBEPBE/SDD
title: #p freq=noraman PBEPBE/SDD
converged: YES YES NO NO
title: Mulliken charges:
elementType: O O C C C C C C C C H H H H H H H H H H H H H H
charge: -0.310855 -0.293072 0.384034 -0.428483 -0.299837 -0.740693 -0.370614 0.522292 -0.796154 -0.729328 0.218057 0.218981 0.193030 0.208508 0.220325 0.225545 0.245003 0.208755 0.186890 0.213878 0.254199 0.222445 0.222689 0.224406
chargesum: 0.00000
title: Mulliken charges with hydrogens summed into heavy atoms:
elementType: O O C C C C C C C C
charge: -0.310855 -0.293072 0.384034 0.008554 0.101701 -0.049820 0.025031 0.522292 -0.105632 -0.282233
polarizability: 1.14245919e+02 1.32582377e+01 9.13405656e+01 -4.71415017e+00 1.14825600e+00 7.33848484e+01
1716.lowfreq: -14.8563 -3.2320 -0.0005 -0.0003 0.0007 8.3382 27.2050 38.5239 80.0845
frequency: 26.8660 38.4952 80.0716 91.5369 116.4983 172.2966 174.7313 222.1384 254.0891 337.2826 355.0442 381.0795 397.2576 424.8345 455.8106 548.2691 682.3808 704.9450 759.4820 831.9759 870.9579 906.5718 919.7137 951.0808 962.3076 968.3140 981.4414 1023.4260 1029.8736 1034.4815 1053.0604 1064.8193 1079.3031 1130.0067 1167.9558 1197.0741 1290.1186 1301.8461 1325.5747 1373.1047 1388.7052 1389.8502 1399.0709 1432.8031 1453.0744 1458.1913 1463.9231 1471.4577 1478.7059 1481.0804 1489.7444 1676.5218 2901.7000 2927.6432 2972.5521 2976.8068 2984.1866 2990.1621 3055.2736 3062.7620 3083.0738 3090.1293 3096.4439 3103.3391 3166.8136 3193.4751
redmass: 3.1854 3.2050 2.9035 3.1437 2.9256 1.1013 1.1230 3.7209 4.1302 2.8543 2.3251 2.2790 2.3524 2.8217 2.6200 3.3045 2.3693 1.4606 3.9650 3.2969 3.8042 1.4686 2.6001 1.3175 1.3992 1.6643 1.5226 1.7398 3.5345 1.6645 1.4670 1.7144 1.6324 1.2970 1.1563 1.1072 2.0781 2.4702 1.4703 1.8926 1.3629 1.4091 1.5679 1.1836 1.0548 1.0570 1.0764 1.0654 1.0829 1.1509 1.2019 5.1284 1.0609 1.0562 1.0397 1.0979 1.1052 1.0364 1.0934 1.0536 1.0983 1.0633 1.1000 1.1003 1.1186 1.1139
irintensity: 1.5243 0.0584 1.4656 0.6263 7.9784 0.6135 1.9566 13.4303 0.1516 7.0333 0.5847 3.9706 0.3081 3.3256 3.2297 4.7079 3.5734 2.3513 25.5971 2.0955 4.8866 5.3574 13.4279 82.5686 2.9032 1.3408 2.8812 54.2735 155.3025 2.3132 2.1956 8.1021 20.9701 9.8726 3.4388 4.3468 15.2933 3.5511 21.9986 5.7444 20.6721 24.7309 13.0847 2.6984 13.8492 10.8999 11.2781 14.0661 22.4152 2.7884 4.5064 16.9747 49.9851 68.1046 14.2135 75.7301 27.2500 20.4040 20.5879 27.2811 20.2109 9.9059 23.1708 19.5600 29.7378 23.5571
temp: 298.150 k
press: 1.00000 atm
elementType: 8 8 6 6 6 6 6 6 6 6 1 1 1 1 1 1 1 1 1 1 1 1 1 1
symmnumber: 1
zpe: 531582.2 jmol-1
zpe.correction: 0.202469 hartree
zpe.thermalcorrener: 0.214672 hartree
zpe.thermalcorrenthalpy: 0.215616 hartree
zpe.thermalcorrgfe: 0.162898 hartree
zpe.sumelectzpe: -462.803916 hartree
zpe.sumelectthermal: -462.791714 hartree
zpe.sumelectthermalent: -462.790770 hartree
zpe.sumelectthermalfe: -462.843488 hartree
dipole: -1.8012 0.4129 0.1171
dipole: 1.8516
quadrupole: -69.9002 -56.9983 -60.9427
quadrupole: 1.3939 5.7502 1.2640
quadrupole: -7.2865 5.6154 1.6711 1.3939 5.7502 1.2640
hfenergy: -463.0063854 hartree
pointgroup: C01 [X(C8H14O2)]
dipole: 0.7113183 0.1336324 -0.082882 debye
dipolederiv: -0.6636289 0.0095171 0.1442571 -0.0603054 -0.3495182 0.0008549 0.1293618 -0.0309042 -0.5252344 -1.2696712 0.0770173 0.0420787 -0.0527211 -0.3815969 0.0076951 -0.0111606 -0.0013662 -0.4015432 0.3649943 -0.0529354 0.0272792 0.0497332 0.2879091 0.0819111 0.0320436 0.164411 0.3824634 0.1549083 0.1347914 0.0420081 0.0103043 0.1495244 -0.0047556 0.0640112 -0.0711033 0.2175899 0.7274767 -0.0466645 -0.1242853 0.0795037 0.3534394 -0.023472 -0.3482867 -0.0310453 0.2762318 -0.0405892 0.0053507 -0.0308504 0.0280327 -0.0233307 -0.11206 -0.0376076 -0.093331 -0.1025346 0.8555675 -0.096051 0.0777403 -0.0455793 0.3234062 0.0451658 0.3203592 0.0663603 0.3224223 0.057199 -0.0600439 -0.1014578 -0.0968655 0.3052773 -0.0936723 -0.1250301 -0.1199408 0.0146098 -0.0107659 0.0532764 -0.008321 0.0401672 -0.1347999 0.097197 0.0432495 0.0894316 0.0087904 -0.2363815 0.07484 -0.167308 0.0040236 -0.1520307 -0.133556 -0.1620467 -0.140377 -0.2761757 0.072263 -0.1086123 -0.0417273 -0.0843156 -0.0779954 -0.0323467 -0.0681425 -0.0682626 0.0125882 0.0228951 0.0101821 -0.1049988 0.0103371 0.0317359 0.045935 -0.1024015 0.0947536 -0.0644526 -0.0506101 0.0393144 0.0068582 -0.042004 -0.1616857 0.1305467 0.070556 0.07916 0.0038524 -0.0336721 -0.0234416 -0.0196713 0.0004571 -0.0543354 -0.1494448 0.0645302 -0.0992229 -0.0900131 0.1110781 -0.0173145 -0.0092389 -0.0115879 -0.1253118 0.0448381 0.0287995 0.0957283 0.0353799 -0.0676496 0.0232707 -0.1303323 0.0620984 0.0723101 0.0266571 -0.1066122 0.0018563 0.0204825 0.0047165 0.0051718 0.1166713 0.0128271 0.0763331 0.0028336 0.1241773 -0.0283713 0.0359208 -0.040244 -0.0107308 0.000144 0.0317934 -0.1689565 0.1157908 -0.0515301 0.0660633 0.0187764 -0.0826039 0.042534 0.0444096 0.0037653 -0.0386277 -0.157686 -0.0659077 -0.1005719 -0.1263445 0.1245826 0.0006221 0.0251411 0.0300017 -0.0693036 -0.086816 -0.0066914 -0.1370363 -0.0411532 0.0065324 0.0306458 -0.1148534 0.050569 0.0696888 0.0038839 -0.1171007 0.0456517 0.050277 -0.0883054 -0.0630163 0.1399687 -0.0010896 0.0659141 0.0158943 0.1171078 0.048756 0.0232265 0.1118118 -0.0166295 0.0591575 0.0096902 -0.0768824 0.1062054 0.0463437 0.1205047 0.1164653 -0.0299035 -0.011094 0.1273306 -0.0288357 0.0788366 0.0684006 0.161978 0.048856 0.0883746 unknown
polarizability: 112.8216527|-14.3559295|92.2090033|-5.7081924|-1.3054539|73.9406775 unknown
InChI: InChI=1S/C8H14O2/c1-7(2)4-9-5-8(3)6-10-8/h1,4-6H2,2-3H3
charge 0 multiplicity 1
24 atoms
O  -3.353379 0.248637 0.803077
O  0.301032 -0.16239 0.054337
C  -2.108182 -0.112069 0.005858
C  -2.691969 1.262446 -0.105136
C  -0.892244 -0.30747 0.899117
C  -2.301878 -1.129746 -1.099774
C  1.543518 -0.424739 0.808522
C  2.728293 -0.111431 -0.083649
C  2.742442 1.270306 -0.704888
C  3.714899 -1.026483 -0.270787
H  -2.210145 2.100935 0.413975
H  -3.273154 1.525899 -0.997485
H  -0.918208 -1.320435 1.360229
H  -0.892097 0.447139 1.715033
H  -2.415612 -2.145405 -0.678553
H  -3.200985 -0.901966 -1.696545
H  -1.416652 -1.12796 -1.760103
H  1.566603 -1.482946 1.145759
H  1.559474 0.23004 1.711874
H  2.719235 2.056218 0.076186
H  1.839918 1.414098 -1.32584
H  3.637686 1.42649 -1.329915
H  3.667513 -2.026906 0.176057
H  4.598894 -0.800359 -0.877945
