program: Gaussian 09
title: 000230021
version: EM64L-G09RevD.01
frameworkgroup: C1[X(C18H20BrNO2)]
method: RPBEPBE
basis: SDD
operation: Freq
keyword: #p
keyword: freq=noraman
keyword: PBEPBE/SDD
title: #p freq=noraman PBEPBE/SDD
converged: YES YES NO NO
title: Mulliken charges:
elementType: Br O O N C C C C C C C C C C C C C C C C C C H H H H H H H H H H H H H H H H H H H H
charge: -0.003770 -0.280816 -0.265998 -0.609880 -0.251823 -0.419725 -0.413799 0.539986 0.526703 0.233218 -0.704410 -0.429925 -0.401990 -0.439241 -0.376505 -0.188637 -0.203099 -0.358553 -0.371024 0.313643 -0.225366 -0.537957 0.254238 0.215904 0.236099 0.184350 0.232518 0.215343 0.211788 0.263356 0.234296 0.228916 0.271551 0.249189 0.245282 0.249076 0.239945 0.331524 0.316907 0.221349 0.245177 0.222158
chargesum: 0.00000
title: Mulliken charges with hydrogens summed into heavy atoms:
elementType: Br O O N C C C C C C C C C C C C C C C C C C
charge: -0.003770 -0.280816 -0.265998 0.038551 0.002415 -0.203821 0.006650 0.539986 0.526703 0.233218 -0.044760 -0.166569 -0.167694 -0.210325 -0.104953 0.060553 0.042183 -0.109477 -0.131079 0.313643 -0.225366 0.150726
polarizability: 3.49276693e+02 -2.19474869e+01 1.49104903e+02 9.27642037e+00 1.48568782e+01 1.85208742e+02
1716.lowfreq: -10.4609 -1.2041 -0.0004 -0.0004 0.0005 3.6249 20.1790 24.6554 38.9457
frequency: 19.4517 24.6390 38.8604 44.9258 45.8305 60.8468 83.0865 100.8091 116.1420 122.7787 132.9378 154.9546 168.4529 176.0031 218.8886 236.7557 246.8932 276.5144 288.0136 300.6518 325.9940 334.0381 368.7334 406.7590 415.5563 427.0496 449.8507 492.7465 503.9069 511.9034 530.9183 551.0933 589.8378 600.3402 624.7395 627.5529 636.3087 693.7663 721.7054 732.3386 755.2435 766.9938 813.1108 822.1158 826.3506 832.1627 840.5966 863.7646 882.7366 920.8849 949.2777 954.8398 967.1669 969.7659 988.2295 994.9464 1003.8126 1016.1178 1047.2933 1055.1184 1062.1565 1086.6769 1094.3017 1111.0052 1112.0098 1125.0335 1156.0068 1180.8000 1188.3270 1196.3468 1204.9514 1216.5869 1231.3036 1243.0470 1252.7314 1292.9046 1296.3630 1312.5603 1326.6824 1333.8599 1357.0658 1375.8191 1385.4210 1390.5690 1399.6190 1420.0692 1436.5422 1467.0218 1470.8774 1472.3186 1473.4826 1475.4495 1486.2143 1498.6728 1578.8469 1581.0553 1592.2003 1593.2124 1620.0494 1636.7203 2959.5353 2969.7529 2977.0338 2983.9594 3007.3456 3040.6423 3047.2509 3070.8428 3080.4229 3117.5988 3124.6658 3125.2613 3137.6524 3142.7643 3161.4389 3164.4170 3165.9487 3169.8714 3516.6249 3672.6162
redmass: 6.1916 6.9180 3.5610 4.1300 3.8436 4.9525 3.1740 3.8935 8.0265 3.8218 4.0052 3.5319 3.4840 2.9164 1.8656 1.2812 2.2309 3.9041 5.2806 4.5057 5.2677 4.0252 5.2106 2.8710 2.9710 3.8964 3.5923 2.7218 1.5873 2.1965 2.8316 2.4808 2.1169 2.5325 7.0388 4.6323 4.2014 3.4614 3.2783 3.8451 2.2165 5.0433 1.9669 1.3138 1.4727 1.3899 1.6317 2.7389 3.2238 1.9858 1.4259 1.3761 1.3590 1.3890 8.5081 4.9285 2.6682 4.2620 1.8526 1.9017 2.3133 2.1765 1.8790 1.3660 1.2969 1.5813 1.3503 1.2813 1.1138 1.9893 2.2724 1.4219 3.0871 1.4231 1.6337 1.2759 1.3204 1.3240 1.6548 1.5296 2.9715 5.2200 4.3009 1.2437 2.0274 2.9881 1.1744 1.0501 2.3318 1.0752 1.0695 1.0419 1.0704 2.3860 7.0481 6.1726 1.7564 5.8528 6.2299 2.5969 1.0330 1.0663 1.0363 1.0823 1.0833 1.0948 1.1040 1.0996 1.0997 1.0894 1.0993 1.0886 1.0888 1.0893 1.0945 1.0950 1.0951 1.0963 1.0450 1.1040
irintensity: 0.3199 0.1482 0.5582 8.8739 0.7291 9.8667 3.3805 2.4095 5.0585 4.8000 1.0669 1.8202 0.7884 1.2244 0.4197 0.2353 2.3276 0.9527 2.2786 3.2042 4.5287 2.9521 2.6779 0.2098 0.1044 2.4790 3.7617 15.3418 105.9742 33.0502 10.5512 34.8820 126.3105 42.4435 0.7531 10.7368 5.3782 31.0870 7.6389 1.1521 1.4126 13.3208 53.9068 0.4346 1.7685 8.9681 57.6107 9.7626 7.5119 7.1408 0.0976 0.4542 0.8337 1.2002 46.6457 61.7584 10.9231 1.0100 0.1446 2.0245 30.7655 5.3259 4.2275 11.1023 4.1546 5.4000 0.3760 100.4575 0.6557 9.7437 4.7980 5.7084 179.4805 15.4969 17.8209 2.1972 26.2998 0.8238 3.5020 10.8826 94.6465 1.5088 20.8283 19.7906 5.6525 1.6861 12.8959 13.4508 103.5196 56.2881 2.2965 8.2739 10.1412 146.7718 0.2763 5.0177 46.2647 5.0510 54.3917 221.5852 70.9355 21.5762 32.7343 11.4530 17.0118 15.2653 48.1049 39.1190 57.5683 16.7509 28.6880 12.0248 2.9735 3.5388 12.2771 8.5959 7.7113 1.4711 34.1365 21.8187
temp: 298.150 k
press: 1.00000 atm
elementType: 35 8 8 7 6 6 6 6 6 6 6 6 6 6 6 6 6 6 6 6 6 6 1 1 1 1 1 1 1 1 1 1 1 1 1 1 1 1 1 1 1 1
symmnumber: 1
zpe: 885497.5 jmol-1
zpe.correction: 0.337268 hartree
zpe.thermalcorrener: 0.359436 hartree
zpe.thermalcorrenthalpy: 0.360381 hartree
zpe.thermalcorrgfe: 0.282994 hartree
zpe.sumelectzpe: -914.974815 hartree
zpe.sumelectthermal: -914.952646 hartree
zpe.sumelectthermalent: -914.951702 hartree
zpe.sumelectthermalfe: -915.029089 hartree
dipole: -3.1232 -0.2783 1.6538
dipole: 3.5450
quadrupole: -140.1582 -137.9736 -131.2334
quadrupole: -1.2323 10.3791 -4.5389
quadrupole: -3.7032 -1.5185 5.2217 -1.2323 10.3791 -4.5389
hfenergy: -915.3120828 hartree
pointgroup: C01 [X(C18H20Br1N1O2)]
dipole: -1.2678065 0.2837107 -0.5073044 debye
polarizability: 346.1489661|33.5345541|146.6256274|-7.3096893|-3.2307188|190.8157446 unknown
InChI: InChI=1S/C18H20BrNO2/c1-3-16(12-4-8-14(19)9-5-12)17(18(20)21)13-6-10-15(22-2)11-7-13/h4-11,16-17H,3,20H2,1-2H3
charge 0 multiplicity 1
42 atoms
Br 6.857471 0.546173 -0.455567
O  0.277924 1.428007 2.054383
O  -5.854689 -0.332669 -0.323943
N  0.498093 2.893152 0.274523
C  0.684899 -0.754325 0.116776
C  -0.143594 0.546005 -0.213911
C  0.223507 -1.964908 -0.737775
C  2.181349 -0.460091 -0.025423
C  -1.659165 0.325131 -0.198383
C  0.232892 1.646316 0.804959
C  0.948583 -3.276838 -0.369098
C  2.991856 -0.261133 1.120176
C  2.791114 -0.345942 -1.30244
C  -2.403776 0.372907 -1.406436
C  -2.353092 0.051512 1.005926
C  4.369885 0.034575 1.007172
C  4.165469 -0.050098 -1.439807
C  -3.793235 0.152008 -1.4184
C  -3.747523 -0.173855 1.012724
C  -4.471046 -0.125013 -0.205277
C  4.939958 0.136323 -0.27685
C  -6.60199 -0.62784 0.900829
H  0.480143 -0.984168 1.180991
H  0.147449 0.878069 -1.230982
H  -0.865312 -2.095617 -0.598556
H  0.370131 -1.748746 -1.816128
H  2.036966 -3.203219 -0.54387
H  0.563424 -4.121315 -0.969286
H  0.795978 -3.524197 0.698495
H  2.535939 -0.31996 2.114618
H  2.198162 -0.502606 -2.211555
H  -1.889103 0.580108 -2.353109
H  -1.797386 0.037255 1.950407
H  4.980657 0.184801 1.901993
H  4.622779 0.028676 -2.430465
H  -4.371407 0.187401 -2.346714
H  -4.252413 -0.378062 1.961702
H  0.729044 3.656237 0.911055
H  0.476364 3.071161 -0.727528
H  -6.242354 -1.560557 1.377506
H  -7.645172 -0.755886 0.576665
H  -6.536676 0.207428 1.625106
