program: Gaussian 09
title: 000230009
version: EM64L-G09RevD.01
frameworkgroup: C1[X(C15H26N4O2)]
method: RPBEPBE
basis: SDD
operation: Freq
keyword: #p
keyword: freq=noraman
keyword: PBEPBE/SDD
title: #p freq=noraman PBEPBE/SDD
converged: YES YES NO NO
title: Mulliken charges:
elementType: O O N N N N C C C C C C C C C C C C C C C H H H H H H H H H H H H H H H H H H H H H H H H H H
charge: -0.257814 -0.273231 -0.395648 -0.423003 -0.637429 -0.034374 -0.382590 -0.381466 -0.375851 -0.372639 -0.382913 -0.353396 -0.364879 -0.356502 -0.403957 -0.695820 0.310030 -0.122949 0.143761 0.176819 -0.311022 0.192368 0.192007 0.193149 0.193955 0.194674 0.199260 0.189896 0.189459 0.192783 0.190576 0.188128 0.188635 0.231548 0.207020 0.195161 0.194567 0.216253 0.262074 0.209693 0.215684 0.210153 0.300171 0.335116 0.328479 0.344742 0.339325
chargesum: 0.00000
title: Mulliken charges with hydrogens summed into heavy atoms:
elementType: O O N N N N C C C C C C C C C C C C C C C
charge: -0.257814 -0.273231 -0.095477 -0.087887 0.046637 -0.034374 0.001785 0.005638 0.018083 0.006717 0.000445 0.023368 0.073689 0.033226 0.074369 -0.060290 0.310030 0.205530 0.143761 0.176819 -0.311022
polarizability: 2.50441723e+02 3.76301406e+01 2.08143926e+02 1.63464440e+01 -2.13170849e+01 1.75336221e+02
1716.lowfreq: -6.4280 -0.0003 0.0003 0.0011 2.0153 4.3551 9.3956 13.6158 25.8860
frequency: 6.9607 13.6054 25.7850 31.7224 43.3478 47.4461 62.8421 69.1825 73.2630 77.4992 101.1819 116.8739 119.6942 130.2707 132.8247 151.6666 154.0116 180.4671 205.6106 224.9863 230.1761 231.5846 273.5525 296.3699 316.9159 343.0789 364.6609 417.4498 429.3849 458.9673 469.0935 487.0440 513.6826 519.9465 542.9638 548.8652 604.1109 605.4947 672.3709 687.1049 708.6463 719.7898 723.5935 734.1612 738.9434 758.4224 786.4106 814.4081 861.7626 883.7754 891.5425 912.7907 951.6082 978.6826 992.8611 1004.8221 1016.0027 1021.7907 1035.7162 1052.9892 1065.8097 1076.4724 1080.6764 1084.2093 1090.0970 1113.5266 1123.0611 1141.1287 1184.5705 1198.8639 1213.7868 1216.4010 1244.4122 1249.9516 1263.5297 1271.9676 1277.4661 1280.4840 1287.3676 1292.6036 1295.7886 1299.1913 1320.4977 1323.6093 1344.9722 1352.1722 1354.4822 1356.4166 1357.3724 1368.5957 1390.1189 1448.5526 1455.9039 1458.3137 1461.0735 1462.1785 1464.7291 1468.1267 1473.8828 1476.9830 1479.9653 1485.3151 1488.7552 1491.7951 1578.2997 1618.0471 1652.0962 1684.0623 2131.9070 2944.8713 2949.0488 2950.2874 2952.3466 2957.3868 2963.3464 2967.8470 2971.4553 2979.5980 2982.1125 2985.6182 2991.2913 3000.7536 3002.4087 3016.0254 3028.9647 3039.4671 3048.6345 3067.8044 3070.3591 3081.5012 3159.2562 3487.3535 3517.7720 3551.9902 3672.9142
redmass: 5.6415 7.0533 2.4844 2.1352 4.5840 6.2620 4.1189 4.2185 3.5566 1.9628 3.7960 3.8900 1.9947 4.3949 3.2524 2.0834 2.5736 4.5990 4.4367 4.3372 1.1162 3.2052 4.7139 4.2063 2.6007 2.5869 3.3237 4.8386 2.2212 2.1782 2.4319 5.1315 1.4242 3.1190 2.5940 1.7026 3.1903 2.0684 4.1846 1.9470 4.7652 1.0638 1.0957 1.1699 4.8496 1.3056 2.1399 1.5037 1.5803 2.0716 1.8102 1.9689 1.7519 2.1975 3.1911 1.3017 3.0677 1.2083 3.5852 1.8997 3.0489 2.4664 2.1728 2.7460 2.4074 3.0682 2.7369 1.8433 1.7753 1.6857 1.4757 1.4737 1.3402 1.3158 1.6559 1.2639 1.1486 1.1095 1.0710 1.1502 1.1065 1.2213 2.7852 1.4543 1.4372 1.5427 3.2213 1.6382 1.6212 1.3466 1.2177 1.4675 1.2231 1.1516 1.0743 1.0770 1.0673 1.0803 1.0819 1.0434 1.0866 1.0978 1.0980 1.7336 2.4268 2.0928 5.1212 5.0891 12.5917 1.0584 1.0587 1.0588 1.0592 1.0594 1.0589 1.0587 1.0365 1.0650 1.0941 1.0956 1.0991 1.0838 1.0834 1.1037 1.1043 1.1040 1.1012 1.1007 1.0993 1.1012 1.0925 1.0771 1.0453 1.0777 1.1043
irintensity: 0.6540 0.7396 0.0781 0.1419 0.5857 6.4588 0.4133 3.5106 4.2323 2.2047 13.3182 3.5861 1.5252 3.1446 4.5083 0.6184 1.0255 0.5363 3.7283 0.4318 0.0020 3.8652 1.4272 14.8594 5.0168 12.3901 8.5351 3.4660 17.5175 20.1699 17.6489 0.8031 51.4027 33.2221 52.4693 73.1790 58.4720 111.2450 7.1935 37.7884 50.9621 17.8807 0.5305 5.8281 96.2934 0.9043 1.1511 4.1474 1.1237 1.9285 5.5004 2.4665 32.7765 14.1570 7.1395 24.9438 1.5607 3.1692 0.5390 7.5656 1.9012 7.0325 0.2477 2.8291 8.2804 6.7939 8.3241 2.4644 0.2032 227.0348 103.5011 5.4266 69.1122 5.1166 601.3797 2.8017 0.4740 0.5300 0.0526 2.9685 1.2140 21.4091 45.3561 0.6865 2.2695 5.2393 173.5598 4.5445 0.3452 2.2667 11.2668 45.5996 26.3940 8.0199 1.9593 0.9570 2.5667 0.5670 6.3118 10.9993 6.3626 18.4656 44.8788 522.2877 239.6995 15.2367 581.8777 266.6641 84.2032 10.9478 0.9900 2.8547 0.2146 0.7700 48.6476 173.9772 37.9042 41.2909 5.3201 7.0451 3.8653 19.3441 12.9486 1.7222 0.8583 107.6850 163.1486 96.4893 53.9059 9.7149 21.0809 11.0554 61.4767 27.0665 42.5281
temp: 298.150 k
press: 1.00000 atm
elementType: 8 8 7 7 7 7 6 6 6 6 6 6 6 6 6 6 6 6 6 6 6 1 1 1 1 1 1 1 1 1 1 1 1 1 1 1 1 1 1 1 1 1 1 1 1 1 1
symmnumber: 1
zpe: 1047993.2 jmol-1
zpe.correction: 0.399160 hartree
zpe.thermalcorrener: 0.424418 hartree
zpe.thermalcorrenthalpy: 0.425362 hartree
zpe.thermalcorrgfe: 0.337828 hartree
zpe.sumelectzpe: -955.031749 hartree
zpe.sumelectthermal: -955.006491 hartree
zpe.sumelectthermalent: -955.005546 hartree
zpe.sumelectthermalfe: -955.093080 hartree
dipole: 4.0337 0.2185 3.2754
dipole: 5.2007
quadrupole: -141.5160 -125.2093 -141.1368
quadrupole: 15.3224 -10.9963 12.2119
quadrupole: -5.5620 10.7447 -5.1827 15.3224 -10.9963 12.2119
hfenergy: -955.4309083 hartree
pointgroup: C01 [X(C15H26N4O2)]
dipole: -1.5889955 -0.0572173 1.2877678 debye
polarizability: 251.2797671|36.9986547|207.7196289|-16.3793398|21.2348854|174.922475 unknown
InChI: InChI=1S/C15H26N4O2/c1-2-3-4-5-6-7-8-9-10-18-15(21)19-12-13(11-16)14(17)20/h12,18-19H,2-10,17H2,1H3
charge 0 multiplicity 1
47 atoms
O  2.744255 -2.325116 -1.004965
O  6.348627 0.858707 -1.929352
N  1.38268 -1.988523 0.873183
N  3.156815 -0.504118 0.434458
N  6.808071 2.611736 -0.471075
N  4.420098 2.440815 2.241693
C  -3.953175 -0.528492 0.412022
C  -5.237586 -0.2399 -0.39678
C  -3.000646 -1.522536 -0.290268
C  -6.184813 0.765524 0.296929
C  -1.716529 -1.815014 0.518254
C  -7.469724 1.053443 -0.511373
C  -0.761048 -2.791035 -0.204121
C  -8.412922 2.06581 0.178663
C  0.508181 -3.147807 0.602972
C  -9.694289 2.347947 -0.635074
C  2.42648 -1.673167 0.025234
C  4.213268 -0.01761 -0.296532
C  4.962516 1.093939 0.049353
C  6.086479 1.499212 -0.866489
C  4.670457 1.827013 1.239092
H  -4.230911 -0.927711 1.410214
H  -3.41578 0.425363 0.597113
H  -5.780802 -1.191523 -0.575174
H  -4.959656 0.150881 -1.398042
H  -3.538411 -2.474843 -0.479821
H  -2.720824 -1.120674 -1.286212
H  -5.641919 1.717938 0.473021
H  -6.462253 0.376697 1.299334
H  -1.193734 -0.855386 0.715393
H  -1.996245 -2.234277 1.508461
H  -8.017442 0.103063 -0.683263
H  -7.193844 1.438211 -1.515662
H  -0.455167 -2.369682 -1.181256
H  -1.297998 -3.736704 -0.421574
H  -7.864894 3.015078 0.349289
H  -8.687564 1.68151 1.182442
H  0.230414 -3.599485 1.574377
H  1.114205 -3.880146 0.042706
H  -10.276282 1.420129 -0.792521
H  -10.349911 3.074642 -0.120791
H  -9.447706 2.761178 -1.63145
H  1.145524 -1.375838 1.654805
H  2.89994 -0.022492 1.302979
H  4.459327 -0.565587 -1.213262
H  6.598794 3.125318 0.384509
H  7.577245 2.917809 -1.064838
