program: Gaussian 09
title: 000230008
version: EM64L-G09RevD.01
frameworkgroup: C1[X(C11H16N4O2)]
method: RPBEPBE
basis: SDD
operation: Freq
keyword: #p
keyword: freq=noraman
keyword: PBEPBE/SDD
title: #p freq=noraman PBEPBE/SDD
converged: YES YES NO NO
title: Mulliken charges:
elementType: O O N N N N C C C C C C C C C C C H H H H H H H H H H H H H H H H
charge: -0.262168 -0.273820 -0.432601 -0.427733 -0.637952 -0.035479 -0.033851 -0.462371 -0.423830 -0.410165 -0.401088 -0.378039 0.305722 -0.127238 0.141541 0.176652 -0.312647 0.261559 0.220681 0.210459 0.200564 0.248437 0.177455 0.216260 0.211375 0.198618 0.197475 0.207383 0.297669 0.335099 0.328664 0.344497 0.338871
chargesum: 0.00000
title: Mulliken charges with hydrogens summed into heavy atoms:
elementType: O O N N N N C C C C C C C C C C C
charge: -0.262168 -0.273820 -0.134932 -0.092635 0.045416 -0.035479 0.227707 -0.031231 0.025171 -0.016450 0.008905 0.026820 0.305722 0.201426 0.141541 0.176652 -0.312647
polarizability: 2.31008157e+02 -9.65486964e+00 1.61470706e+02 -8.65834578e+00 -4.03396685e-01 9.69010244e+01
1716.lowfreq: -2.7979 -0.0005 -0.0004 0.0003 4.5347 14.8582 29.8377 37.9821 51.7990
frequency: 27.4271 37.0289 51.0712 63.9313 70.1247 99.1811 116.6223 128.9889 183.5730 206.1265 220.2621 233.0253 264.8272 306.4559 317.4447 367.8707 385.0072 421.1579 437.3429 464.5456 477.0413 492.8989 517.2334 522.2929 548.2914 604.9729 605.6919 641.0125 686.8250 688.6639 713.0783 739.1625 775.8747 795.3286 818.2649 837.8980 862.4782 871.8833 925.1038 959.4188 991.3465 1006.3840 1012.9765 1045.8383 1055.2638 1056.1981 1091.5272 1109.1991 1116.3641 1145.8457 1156.1275 1196.1925 1242.3164 1258.0522 1261.1153 1276.2657 1301.0015 1319.1274 1326.9485 1331.6969 1336.1528 1349.6264 1354.3537 1357.2350 1367.1815 1445.0668 1456.7483 1465.2019 1467.4542 1470.2395 1476.1646 1489.5588 1578.8834 1618.7035 1651.0524 1679.9736 2131.4690 2944.8576 2970.1887 2972.4443 2984.0439 2987.3203 3026.9595 3031.4724 3035.4428 3042.5284 3048.4354 3058.4188 3159.2969 3486.8743 3518.4036 3539.5304 3673.5460
redmass: 5.8628 4.6229 4.6973 5.4730 5.7680 4.8863 6.7674 6.8438 4.3579 2.9050 3.6384 3.6715 4.9353 2.6396 2.4965 2.1663 2.3263 4.6173 1.6972 2.3452 3.5255 2.7439 1.3086 4.5591 1.5681 1.7279 4.1606 2.6169 5.1639 1.9363 6.3466 4.9767 1.5347 3.5901 3.2210 1.9398 2.4112 2.0802 1.4162 2.9286 3.0668 1.3008 2.8847 1.4619 1.8208 1.7794 1.7135 3.3833 1.0550 2.3329 1.7247 1.8631 1.3606 1.4037 1.3963 1.3484 1.6801 3.0376 1.5446 1.3808 1.4128 1.4407 3.2848 1.4639 1.3470 1.8501 1.1266 1.1043 1.0872 1.4986 1.0889 1.2274 2.6348 2.0347 4.8606 5.0850 12.5892 1.0687 1.0655 1.0614 1.0633 1.0619 1.0862 1.0926 1.0963 1.1002 1.1016 1.1003 1.0924 1.0771 1.0454 1.0775 1.1042
irintensity: 0.0968 0.2187 0.5416 9.7718 5.7911 7.2917 13.9327 5.3294 0.8020 1.2167 0.9248 1.5458 26.0878 0.6630 2.5684 0.2450 11.2604 3.3823 25.3875 1.4917 11.9771 3.9660 73.0127 4.1305 127.9635 134.5087 18.8741 6.2315 3.8724 29.9008 41.7962 89.4391 1.2888 1.9747 2.3365 1.5209 8.4028 5.0793 15.5434 73.0815 18.1342 23.9729 0.4109 1.2920 3.2022 5.8940 1.1612 6.4093 2.9650 4.0008 10.3147 228.2089 120.4624 288.7654 185.6358 36.4687 43.4716 59.4127 6.1360 2.0822 1.3160 4.4722 203.2351 6.9941 4.4012 45.9247 60.8885 21.3077 15.2841 437.4322 50.7649 202.1342 247.5678 14.0063 571.4046 282.1154 86.5209 38.6843 27.8517 37.8121 21.7665 26.6497 36.7919 72.8767 40.2451 33.4253 60.8172 54.0987 20.9640 9.9932 62.0418 41.8959 42.3116
temp: 298.150 k
press: 1.00000 atm
elementType: 8 8 7 7 7 7 6 6 6 6 6 6 6 6 6 6 6 1 1 1 1 1 1 1 1 1 1 1 1 1 1 1 1
symmnumber: 1
zpe: 705557.8 jmol-1
zpe.correction: 0.268733 hartree
zpe.thermalcorrener: 0.285818 hartree
zpe.thermalcorrenthalpy: 0.286762 hartree
zpe.thermalcorrgfe: 0.222318 hartree
zpe.sumelectzpe: -796.970755 hartree
zpe.sumelectthermal: -796.953670 hartree
zpe.sumelectthermalent: -796.952726 hartree
zpe.sumelectthermalfe: -797.017170 hartree
dipole: 4.3705 3.3700 -0.1374
dipole: 5.5206
quadrupole: -81.4212 -121.6856 -101.6478
quadrupole: -5.0250 -2.8128 -0.6011
quadrupole: 20.1636 -20.1007 -0.0629 -5.0250 -2.8128 -0.6011
hfenergy: -797.2394878 hartree
pointgroup: C01 [X(C11H16N4O2)]
dipole: -1.6819875 0.8943166 1.0433601 debye
polarizability: 230.4833261|15.6250384|130.0622762|-4.7122422|31.5779346|128.8342847 unknown
InChI: InChI=1S/C11H16N4O2/c12-6-8(10(13)16)7-14-11(17)15-9-4-2-1-3-5-9/h7,9,14-15H,1-5,13H2
charge 0 multiplicity 1
33 atoms
O  -0.431007 -1.722762 -1.106791
O  4.384998 -1.030345 -1.61838
N  -1.618793 -0.405108 0.420586
N  0.708544 -0.120131 0.194905
N  5.524556 0.520069 -0.311498
N  3.114587 2.099496 1.875515
C  -2.942267 -1.006271 0.110843
C  -3.901827 -0.775515 1.303555
C  -3.536741 -0.426856 -1.202004
C  -4.324214 0.709063 1.451541
C  -3.946787 1.056402 -1.052644
C  -4.922201 1.256796 0.132979
C  -0.476843 -0.819234 -0.228447
C  1.937305 -0.379983 -0.359925
C  3.113794 0.254534 0.00174
C  4.378009 -0.143921 -0.711085
C  3.117148 1.256418 1.018771
H  -2.76554 -2.088719 -0.029034
H  -3.441473 -1.151282 2.237815
H  -4.80832 -1.385526 1.124659
H  -4.428417 -1.031884 -1.464003
H  -2.805911 -0.560422 -2.019801
H  -3.454048 1.336326 1.745241
H  -5.055037 0.803583 2.276787
H  -4.409947 1.412221 -1.992239
H  -3.041134 1.677862 -0.895077
H  -5.870382 0.722123 -0.08247
H  -5.17699 2.327916 0.245526
H  -1.589728 0.360711 1.096159
H  0.645794 0.588137 0.93425
H  1.960673 -1.147015 -1.142405
H  5.519472 1.232244 0.418136
H  6.400929 0.278573 -0.771302
