program: Gaussian 09
title: 000230005
version: EM64L-G09RevD.01
frameworkgroup: C1[X(C8H12N4O2)]
method: RPBEPBE
basis: SDD
operation: Freq
keyword: #p
keyword: freq=noraman
keyword: PBEPBE/SDD
title: #p freq=noraman PBEPBE/SDD
converged: NO YES NO NO
title: Mulliken charges:
elementType: O O N N N N C C C C C C C C H H H H H H H H H H H H
charge: -0.262519 -0.273265 -0.404987 -0.423570 -0.637189 -0.035058 -0.046233 -0.665026 -0.664740 0.311458 -0.124861 0.143313 0.176912 -0.310306 0.258388 0.223054 0.198252 0.238462 0.238458 0.223008 0.198279 0.290120 0.334894 0.329078 0.344833 0.339245
chargesum: 0.00000
title: Mulliken charges with hydrogens summed into heavy atoms:
elementType: O O N N N N C C C C C C C C
charge: -0.262519 -0.273265 -0.114866 -0.088676 0.046889 -0.035058 0.212154 -0.005258 -0.004995 0.311458 0.204217 0.143313 0.176912 -0.310306
polarizability: 2.01870750e+02 7.39535742e+00 1.32552587e+02 4.12417272e-02 8.51401108e-03 6.99541168e+01
1716.lowfreq: -2.8682 0.0006 0.0006 0.0006 0.5094 8.5364 21.3530 44.3285 52.7662
frequency: 15.7150 44.2502 52.6846 57.7425 73.1964 123.3317 128.1645 157.6815 213.1136 224.3398 237.7548 246.8639 272.1540 317.7521 350.2927 390.5036 419.5847 439.9494 483.0404 498.1047 521.7849 526.5002 548.9742 605.8882 608.4077 685.5174 687.4428 708.9235 739.5238 813.4951 845.9204 922.3614 930.7735 940.6174 991.9761 1007.3901 1055.0342 1108.3010 1140.8533 1143.9725 1173.6060 1205.8756 1264.5326 1319.3241 1327.5133 1338.0370 1354.2825 1380.1053 1396.8024 1447.6870 1463.2657 1467.3406 1472.5859 1484.0685 1498.0780 1578.8892 1618.3657 1652.0657 1682.3468 2128.7903 2977.7936 2980.4595 3042.2102 3070.7696 3083.4088 3093.5879 3097.8681 3158.2109 3486.5977 3517.9950 3527.1459 3673.3721
redmass: 3.0144 4.9984 5.0825 6.2963 5.1822 7.9331 6.2907 4.7930 1.0274 4.7205 3.5477 1.3493 3.4224 2.3607 2.9520 1.9718 4.7674 2.6827 5.6883 1.8771 1.2934 4.9968 1.5720 1.7620 4.4307 6.2084 2.1166 4.5863 4.8786 4.5287 2.5048 1.2461 2.7178 1.3686 3.4526 1.2981 1.8609 3.5826 1.9834 2.3451 2.0337 2.2748 1.6841 3.2191 1.3784 1.3274 3.3374 1.2130 1.2209 1.8889 1.0483 1.0476 1.1996 1.0530 1.4950 2.5121 2.0679 5.1091 5.1565 12.5908 1.0367 1.0377 1.0860 1.0986 1.0967 1.1006 1.1003 1.0924 1.0771 1.0453 1.0772 1.1043
irintensity: 0.5403 4.7063 2.4618 1.3817 12.9204 8.0314 12.6827 0.7298 0.0001 0.4319 4.4839 4.0911 24.5828 2.1401 8.5045 6.2725 3.6292 0.7649 2.8050 13.9168 120.6098 4.6492 104.7238 139.3977 20.7599 3.2662 24.8600 58.5763 95.8821 0.3084 5.0845 4.3494 12.7900 0.0215 59.4424 24.9500 9.3739 12.8609 4.8146 19.3771 164.6526 378.1206 459.5051 55.5065 2.4605 42.2766 199.6123 20.7913 25.9339 45.7951 0.9066 5.2292 194.5841 17.1222 381.1837 233.6855 12.9088 586.5690 277.3363 86.2964 19.0035 30.8528 3.3272 2.9774 60.6458 18.7546 43.1016 21.6602 9.9837 61.7423 27.1293 42.4338
temp: 298.150 k
press: 1.00000 atm
elementType: 8 8 7 7 7 7 6 6 6 6 6 6 6 6 1 1 1 1 1 1 1 1 1 1 1 1
symmnumber: 1
zpe: 533790.8 jmol-1
zpe.correction: 0.203310 hartree
zpe.thermalcorrener: 0.218917 hartree
zpe.thermalcorrenthalpy: 0.219861 hartree
zpe.thermalcorrgfe: 0.158376 hartree
zpe.sumelectzpe: -680.474556 hartree
zpe.sumelectthermal: -680.458949 hartree
zpe.sumelectthermalent: -680.458005 hartree
zpe.sumelectthermalfe: -680.519490 hartree
dipole: -3.6315 3.6733 -0.0031
dipole: 5.1653
quadrupole: -58.3749 -102.7086 -84.3943
quadrupole: -2.3759 0.0038 -0.0143
quadrupole: 23.4511 -20.8827 -2.5684 -2.3759 0.0038 -0.0143
hfenergy: -680.6778661 hartree
pointgroup: C01 [X(C8H12N4O2)]
dipole: 1.3995309 -1.3962312 -0.4708568 debye
dipolederiv: -0.8083029 -0.0427485 -0.0063795 -0.1332828 -0.9411265 -0.1883746 -0.0353131 -0.1905743 -0.4080373 -0.6879651 0.098454 0.0366107 0.2096289 -1.0348163 -0.2159228 0.0721194 -0.2142692 -0.440474 -1.6281798 0.2303561 0.0905793 0.5091683 -0.4195167 0.0367704 0.1829382 0.0403937 -0.5500986 -2.5811337 -0.3515202 -0.0764106 0.186879 -0.2267354 0.0275991 0.095494 0.0365344 -0.3138293 -1.2955798 -0.271981 -0.0776436 -0.2795466 -0.4023398 0.1011448 -0.0798883 0.1010517 -0.669439 -0.2490837 -0.0466222 -0.015046 -0.2023168 -0.5762245 -0.0987921 -0.0648221 -0.1014368 -0.2881732 0.9147591 -0.0117856 -0.010972 0.3075328 0.0795094 -0.1004889 0.0902515 -0.0949829 0.346278 -0.129833 0.0131332 0.0256204 -0.0528872 0.1142448 0.0358567 0.0142558 0.0468648 -0.0918391 -0.1317327 0.0257124 -0.011607 -0.0351663 0.0839483 0.0906448 -0.041413 0.0772356 -0.0613385 2.9136153 0.0652116 -0.0213679 0.2185207 1.3452792 0.339995 0.0268608 0.3431625 0.3855682 2.086735 0.2544344 0.0489614 -0.4019586 -0.0434086 -0.038768 -0.1615735 -0.0492174 0.0843631 -1.3212095 0.0111069 0.0237377 -0.1859036 -0.4673799 -0.1235032 -0.0391007 -0.1267762 -0.1118073 2.0667235 -0.0983363 -0.0605389 -0.3753232 1.2166074 0.3104586 -0.1493209 0.3061396 0.3659407 -0.1703847 0.1696737 0.0575317 0.4014087 0.6510175 0.1925705 0.1316191 0.1964218 0.0889117 0.0921934 0.0451592 0.0136286 -0.0370611 -0.0186284 -0.0211432 -0.0128254 -0.0225994 0.043315 -0.1823743 -0.0716446 0.0088236 -0.0849849 0.0720992 -0.0137201 0.007915 -0.0334052 0.0786565 0.0994232 -0.0188986 0.014536 0.0303978 -0.1477477 -0.1008413 0.023514 -0.0281216 0.045719 0.0649061 0.0732276 -0.0893732 0.0670348 0.0261269 0.0916144 -0.0685644 0.0782913 -0.0517419 0.0690625 0.0082131 0.111254 0.0148181 0.080371 0.0026403 0.0910003 0.0160494 -0.1102014 -0.1838981 -0.0550131 -0.0421057 -0.0667133 0.0509079 -0.0043154 -0.0501437 0.0152675 0.1010439 0.0985901 -0.0070909 -0.0238692 0.0399037 -0.1433967 -0.034804 -0.0017962 -0.1061566 0.0423514 0.1262833 -0.003738 0.0018943 -0.115646 0.1001572 -0.0762491 -0.0341883 -0.0775392 0.3185877 0.1117706 -0.0039274 0.0021638 -0.0479348 0.1094394 -0.0682717 -0.011621 -0.0688784 0.3030354 0.2191958 -0.0235027 -0.008432 0.0176192 0.1519888 -0.0032649 0.005054 -0.0026148 0.1604266 0.2674966 0.0063963 0.0041236 0.0342675 0.157557 -0.075125 0.0129731 -0.0747698 0.3659078 0.2389227 0.0057305 0.0042803 -0.0184543 0.1820663 -0.0657101 -0.0034246 -0.0660705 0.3668746 unknown
polarizability: 202.1065605|6.3404654|126.537599|-0.09101|18.0301913|75.733295 unknown
InChI: InChI=1S/C8H12N4O2/c1-5(2)12-8(14)11-4-6(3-9)7(10)13/h4-5,11-12H,10H2,1-2H3
charge 0 multiplicity 1
26 atoms
O  1.539617 1.63746 0.505074
O  -3.333785 1.910014 0.668996
N  2.554463 -0.372506 -0.158694
N  0.207468 -0.217958 -0.070759
N  -4.664569 0.086389 0.106788
N  -2.46862 -2.640914 -0.801409
C  3.952895 0.103914 -0.024461
C  4.669583 0.062227 -1.392343
C  4.699837 -0.715935 1.051005
C  1.473229 0.439298 0.120063
C  -0.983102 0.428069 0.155698
C  -2.23265 -0.144944 -0.006935
C  -3.440361 0.705896 0.285128
C  -2.363362 -1.499593 -0.437818
H  3.86586 1.15268 0.310769
H  5.694062 0.46417 -1.297525
H  4.749934 -0.975014 -1.771514
H  4.127439 0.66729 -2.139281
H  4.177897 -0.659467 2.02177
H  5.724005 -0.324312 1.184642
H  4.783151 -1.780496 0.757996
H  2.414918 -1.337749 -0.467071
H  0.182707 -1.194714 -0.383202
H  -0.911379 1.470067 0.4882
H  -4.748678 -0.88157 -0.20234
H  -5.505954 0.629197 0.294625
