program: Gaussian 09
title: 000230001
version: EM64L-G09RevD.01
frameworkgroup: C1[X(C16H10N2O4)]
method: RPBEPBE
basis: SDD
operation: Freq
keyword: #p
keyword: freq=noraman
keyword: PBEPBE/SDD
title: #p freq=noraman PBEPBE/SDD
converged: YES YES NO NO
title: Mulliken charges:
elementType: O O O O N N C C C C C C C C C C C C C C C C H H H H H H H H H H
charge: -0.264798 -0.188767 -0.206022 -0.202432 -0.094348 0.026850 0.506749 0.064888 0.298844 0.103206 -0.344300 -0.384632 -0.355399 0.135767 0.380111 -0.383953 -0.385841 -0.361952 -0.331420 -0.218656 -0.222791 -0.222871 0.255321 0.243570 0.312505 0.290818 0.291344 0.272020 0.273282 0.237265 0.237724 0.237915
chargesum: 0.00000
title: Mulliken charges with hydrogens summed into heavy atoms:
elementType: O O O O N N C C C C C C C C C C C C C C C C
charge: -0.264798 -0.188767 -0.206022 -0.202432 -0.094348 0.026850 0.506749 0.064888 0.298844 0.103206 -0.088979 -0.141062 -0.042894 0.135767 0.380111 -0.093135 -0.094497 -0.089932 -0.058138 0.018609 0.014932 0.015044
polarizability: 6.14583191e+02 -1.36026608e+01 2.00283350e+02 -3.05618145e-02 5.91064297e-02 7.43254246e+01
1716.lowfreq: -3.9164 -0.0009 -0.0005 0.0004 0.4427 3.5462 23.1123 37.6448 55.5083
frequency: 23.1089 37.6139 55.5068 56.3788 73.2344 82.5218 115.4875 127.8690 190.8999 200.8955 204.0763 227.9464 281.7841 321.2718 353.3808 379.6102 392.3841 401.5753 421.0403 449.3801 481.5495 503.5676 513.3036 549.9470 611.4879 622.6164 646.2750 660.3938 666.4858 675.1643 695.8823 713.3956 738.1164 746.1768 754.4813 783.9985 787.6751 807.8569 847.1143 847.4019 861.2198 885.9012 943.6840 951.0168 954.6475 987.9567 994.6747 995.6877 1003.4088 1009.6008 1017.3548 1026.4901 1041.2217 1085.8032 1093.0647 1110.5331 1142.8105 1176.4123 1187.9028 1191.9093 1221.9828 1237.6106 1281.6414 1318.6499 1321.9341 1348.8838 1368.5915 1389.3312 1407.1016 1426.7105 1438.9374 1467.5048 1481.1297 1528.6942 1576.5247 1582.1944 1603.3321 1609.9067 1639.9307 1691.6773 3110.8419 3135.4886 3141.3787 3147.0883 3158.7262 3164.8586 3168.7126 3177.1106 3184.1382 3186.5555
redmass: 8.1989 5.3865 6.9160 6.7436 6.3504 6.2393 7.5364 7.7606 8.4450 7.9712 9.3862 6.8132 6.4264 8.2553 4.7817 7.7238 4.1663 2.8420 3.2196 9.4901 3.7192 7.9049 3.4982 7.8174 6.5588 7.3998 9.1373 7.5789 4.8133 6.0469 1.7215 8.5446 9.7986 5.1943 6.4358 9.8371 1.9347 11.9926 5.7810 1.3382 1.2466 1.3896 7.4745 1.4135 1.4842 6.2251 1.3859 1.3891 3.1969 1.3367 3.4628 1.3328 2.8398 1.7304 3.1254 1.9731 2.1781 1.0590 1.1376 2.1579 2.2191 2.9409 3.6289 1.4324 1.3752 2.5447 4.5581 8.5324 4.2755 3.1127 2.3324 2.4582 2.3098 6.5163 7.2154 6.0947 6.0007 6.0407 8.6220 11.8096 1.0872 1.0858 1.0904 1.0889 1.0933 1.0920 1.0967 1.1007 1.0948 1.0959
irintensity: 0.0736 0.0088 0.1403 1.8544 1.5685 0.0417 1.5526 1.2265 0.5260 0.4089 4.4959 0.1549 0.0084 4.3694 1.7606 4.6059 1.3510 0.0349 0.8812 1.0455 4.0404 0.7135 7.7359 2.3548 0.4668 1.2496 1.3273 4.1911 10.8553 41.3635 67.1872 1.0377 3.0058 1.1811 2.9967 108.0656 43.5232 188.3889 3.1676 11.9324 0.0005 32.8938 45.6657 4.6352 41.5291 6.1081 0.0059 0.1647 1.4731 0.2374 10.2142 0.1245 66.5050 12.8982 42.3786 85.8943 126.8643 0.3011 78.1098 316.3114 435.5296 19.6726 42.1252 1.6213 4.9612 28.1108 104.6847 2.7262 1.1699 38.4439 56.3608 132.0803 1.1525 278.4004 13.0609 3.1978 31.9654 4.3824 229.3424 154.6486 6.9281 0.2761 6.3807 8.7178 17.2210 10.4464 12.2106 30.8655 2.2558 1.2398
temp: 298.150 k
press: 1.00000 atm
elementType: 8 8 8 8 7 7 6 6 6 6 6 6 6 6 6 6 6 6 6 6 6 6 1 1 1 1 1 1 1 1 1 1
symmnumber: 1
zpe: 593511.2 jmol-1
zpe.correction: 0.226056 hartree
zpe.thermalcorrener: 0.243534 hartree
zpe.thermalcorrenthalpy: 0.244478 hartree
zpe.thermalcorrgfe: 0.178454 hartree
zpe.sumelectzpe: -1024.506330 hartree
zpe.sumelectthermal: -1024.488853 hartree
zpe.sumelectthermalent: -1024.487909 hartree
zpe.sumelectthermalfe: -1024.553933 hartree
dipole: -7.3694 -3.1516 -0.0010
dipole: 8.0150
quadrupole: -140.4043 -122.3773 -128.4957
quadrupole: -3.9548 -0.0652 -0.0060
quadrupole: -9.9786 8.0485 1.9301 -3.9548 -0.0652 -0.0060
hfenergy: -1024.7323869 hartree
pointgroup: C01 [X(C16H10N2O4)]
dipole: -2.9479929 0.9096388 0.6523012 debye
polarizability: 612.6930035|28.5133569|162.2781973|12.5999594|59.1751962|114.2207649 unknown
InChI: InChI=1S/C16H10N2O4/c19-16-14(10-11-6-8-13(9-7-11)18(20)21)17-15(22-16)12-4-2-1-3-5-12/h1-10H
charge 0 multiplicity 1
32 atoms
O  -2.140493 -1.282302 -0.915528
O  0.073634 -1.912115 -1.364538
O  7.047673 1.055215 0.54925
O  6.780271 -0.818713 -0.727338
N  -1.813043 0.621485 0.36743
N  6.312654 0.172481 -0.043696
C  2.034395 0.557866 0.277946
C  -0.528161 0.124424 0.016366
C  -4.157952 -0.116306 -0.105739
C  -2.706457 -0.19461 -0.174828
C  0.606537 0.789088 0.453613
C  2.912594 1.500584 0.907415
C  2.616082 -0.520936 -0.463438
C  -0.699804 -1.111288 -0.816225
C  4.840451 0.306944 0.068623
C  4.306276 1.385525 0.809781
C  4.011088 -0.644693 -0.566952
C  -4.762466 0.950284 0.618471
C  -4.970753 -1.089948 -0.750749
C  -6.16474 1.037556 0.693641
C  -6.374158 -0.993196 -0.669036
C  -6.974109 0.067516 0.051085
H  0.355269 1.673796 1.055862
H  2.481952 2.331406 1.478014
H  1.97208 -1.25505 -0.953466
H  4.982666 2.099442 1.286272
H  4.469121 -1.462599 -1.129144
H  -4.119155 1.688672 1.107426
H  -4.495206 -1.905281 -1.304155
H  -6.630745 1.857464 1.250127
H  -7.00079 -1.741844 -1.164831
H  -8.065612 0.138934 0.111845
