program: Gaussian 09
title: 000229996
version: EM64L-G09RevD.01
frameworkgroup: C1[X(C14H26O3)]
method: RPBEPBE
basis: SDD
operation: Freq
keyword: #pfreq=noraman
keyword: PBEPBE/SDD
title: #p freq=noraman PBEPBE/SDD
converged: YES YES NO NO
title: Mulliken charges:
elementType: O O O C C C C C C C C C C C C C C H H H H H H H H H H H H H H H H H H H H H H H H H H
charge: -0.283709 -0.275025 -0.246581 -0.020457 -0.425582 -0.406238 -0.362949 -0.320760 -0.355203 -0.722965 -0.697474 -0.229838 -0.318004 0.161414 0.343187 -0.753623 -0.630650 0.208047 0.182528 0.197820 0.230207 0.202761 0.189204 0.202985 0.191651 0.188325 0.194932 0.193145 0.216697 0.216380 0.219452 0.210366 0.210276 0.215636 0.220678 0.191907 0.237328 0.243247 0.238714 0.242810 0.214544 0.229369 0.255451
chargesum: 0.00000
title: Mulliken charges with hydrogens summed into heavy atoms:
elementType: O O O C C C C C C C C C C C C C C
charge: -0.283709 -0.275025 -0.246581 0.187589 -0.045233 0.026730 0.029239 0.059216 0.032874 -0.070437 -0.061196 0.182746 0.162571 0.161414 0.343187 -0.057555 -0.145831
polarizability: 2.19466146e+02 -6.78138501e+00 1.48929471e+02 1.41988301e+01 -7.71857545e+00 1.29494240e+02
1716.lowfreq: -13.0719 -3.5177 -0.0008 -0.0003 0.0003 2.5391 8.9697 20.7320 30.4495
frequency: -5.9058 17.2518 28.4712 34.8609 41.3292 61.5049 63.4088 74.8217 91.4519 108.8838 122.8726 136.1509 154.5579 168.1331 174.9401 219.2799 227.6596 234.5594 245.5614 269.6218 302.5469 317.6954 357.5967 365.3676 389.2191 418.4914 454.2217 503.4236 531.6652 546.2803 591.5597 633.6907 729.7485 755.4760 760.2855 772.9240 784.2321 806.1747 829.5330 888.3565 910.1566 916.2898 932.2708 966.6701 971.9499 980.8793 989.3470 989.4138 1007.6873 1023.4997 1037.3626 1052.9603 1055.7866 1077.6307 1084.2230 1093.1588 1112.9609 1120.2183 1136.1625 1154.2734 1164.1805 1197.2616 1204.2855 1212.0965 1248.7165 1266.9473 1274.0682 1278.8636 1288.9583 1290.3202 1294.8739 1320.1643 1329.7651 1343.9439 1357.4780 1358.4112 1366.1671 1388.5069 1388.9348 1394.9637 1405.3910 1414.7548 1455.0664 1456.9085 1462.2964 1466.5890 1471.1346 1471.6892 1475.7326 1477.1911 1478.7837 1484.9188 1487.4449 1491.9982 1495.1402 1612.5741 1653.7529 2914.3453 2937.6064 2952.6864 2954.9911 2958.0715 2967.3572 2972.1615 2972.6909 2977.2058 2990.2930 2990.6072 2994.0142 2997.4724 3008.4612 3035.0416 3040.3066 3046.5226 3068.6998 3070.6468 3070.9524 3073.1509 3074.6095 3097.6803 3104.2445 3129.1198 3216.6756
redmass: 3.5053 3.7942 3.3622 3.4381 3.4379 2.1133 3.2325 3.1720 3.1674 2.6891 2.9145 2.5288 1.7021 1.2159 2.6602 3.1777 1.1845 1.6744 2.1701 2.4312 2.5747 3.1919 3.5521 3.4021 3.1020 3.6709 3.1925 3.5323 2.3204 3.2413 3.7923 1.5542 1.0898 3.4520 1.3114 1.6865 2.0762 1.3952 1.2953 1.8822 3.7494 1.3671 2.8131 3.0721 1.6424 2.2755 1.8748 1.3494 1.3940 1.4103 2.6090 1.5152 5.9788 2.6148 3.2477 2.1050 2.7935 2.0608 1.7907 2.0982 2.4261 1.1909 1.2418 1.3764 1.2513 1.2081 1.1213 1.1444 1.0949 2.5838 1.3388 1.3035 1.4885 1.4951 1.3813 1.4933 1.4004 1.2321 1.2179 1.1688 1.4553 1.2495 1.0454 1.0971 1.0690 1.0732 1.0596 1.0639 1.0639 1.0442 1.0747 1.0676 1.0566 1.0820 1.0747 9.9828 5.1971 1.0546 1.0558 1.0645 1.0857 1.0615 1.0604 1.0363 1.0922 1.0365 1.0361 1.0764 1.1060 1.0853 1.1000 1.1035 1.0985 1.0578 1.1006 1.0984 1.0993 1.1005 1.0970 1.1009 1.0618 1.1087 1.1157
irintensity: 0.3222 0.1896 1.2937 0.4057 0.2448 0.4564 1.1368 0.3346 0.6751 5.4131 0.1356 1.8987 0.7096 0.4004 1.4377 2.5318 0.4011 2.0597 3.0539 2.5441 0.7235 5.0453 12.0099 4.8936 1.0290 2.3824 1.9200 3.9581 5.6142 5.0984 2.0810 11.8019 9.1947 8.7753 10.8380 8.4859 9.5593 2.9041 0.1106 7.8419 8.4654 4.1503 6.7691 19.9506 0.2649 4.2277 12.0313 51.4078 16.7866 4.2779 20.8917 5.1443 184.7303 4.1246 140.3230 21.4345 188.5984 107.5906 5.2089 2.8749 0.9850 6.8951 11.2134 2.4407 3.2754 1.4403 5.2144 3.3919 4.7791 71.3904 4.1691 4.1911 1.1731 5.8572 0.5103 2.3330 12.0184 19.1358 12.4286 23.3864 0.5317 13.3501 15.9044 14.7584 0.9495 2.2162 40.1270 7.5358 1.0761 12.6388 17.7736 16.1579 10.0403 5.0462 7.3621 126.1125 3.4955 39.2370 63.6170 9.4518 13.5519 5.6489 91.7281 38.2038 45.9031 31.7240 16.9741 12.9469 33.3714 42.6973 17.3440 85.0788 4.9596 26.0559 87.7140 48.2617 57.5523 72.2997 16.6968 27.2367 5.3792 11.0557 5.8543
temp: 298.150 k
press: 1.00000 atm
elementType: 8 8 8 6 6 6 6 6 6 6 6 6 6 6 6 6 6 1 1 1 1 1 1 1 1 1 1 1 1 1 1 1 1 1 1 1 1 1 1 1 1 1 1
symmnumber: 1
zpe: 984960.9 jmol-1
zpe.correction: 0.375152 hartree
zpe.thermalcorrener: 0.396049 hartree
zpe.thermalcorrenthalpy: 0.396993 hartree
zpe.thermalcorrgfe: 0.322447 hartree
zpe.sumelectzpe: -773.338342 hartree
zpe.sumelectthermal: -773.317445 hartree
zpe.sumelectthermalent: -773.316501 hartree
zpe.sumelectthermalfe: -773.391046 hartree
dipole: -0.1115 -2.1363 -0.8490
dipole: 2.3015
quadrupole: -92.9297 -108.5132 -106.0349
quadrupole: 6.7298 1.2375 0.7786
quadrupole: 9.5629 -6.0206 -3.5423 6.7298 1.2375 0.7786
hfenergy: -773.7134937 hartree
pointgroup: C01 [X(C14H26O3)]
dipole: 0.0222133 0.7959049 0.4312118 debye
polarizability: 218.468874|4.4036438|149.7715316|-18.385997|-4.714911|129.6494514 unknown
InChI: InChI=1S/C14H26O3/c1-5-7-8-13(6-2)11-16-9-10-17-14(15)12(3)4/h13H,3,5-11H2,1-2,4H3
charge 0 multiplicity 1
43 atoms
O  0.231064 0.413211 -0.630785
O  -3.428855 0.992529 -0.438476
O  -3.801187 -1.206656 0.255705
C  2.654732 0.114996 -0.542051
C  3.907357 0.300306 0.358457
C  2.576124 -1.27072 -1.244923
C  5.25324 0.133261 -0.3823
C  1.387498 0.4138 0.278647
C  6.473651 0.46093 0.508121
C  2.60174 -2.494805 -0.301113
C  7.820132 0.280386 -0.225582
C  -1.032327 0.641236 0.070096
C  -2.119483 0.575773 -1.008749
C  -4.191189 -0.015696 0.174091
C  -5.491899 0.533775 0.683793
C  -5.785428 2.008833 0.506112
C  -6.342513 -0.344056 1.284401
H  2.698322 0.882731 -1.344012
H  3.875254 1.316484 0.806272
H  3.869402 -0.411314 1.209459
H  1.645188 -1.290755 -1.841616
H  3.413304 -1.351765 -1.965371
H  5.265799 0.79207 -1.276183
H  5.351074 -0.904567 -0.759488
H  1.472776 1.410175 0.76857
H  1.236071 -0.34752 1.076713
H  6.452091 -0.186815 1.408706
H  6.387508 1.504329 0.875018
H  2.517846 -3.431094 -0.882668
H  3.54028 -2.54835 0.28127
H  1.759091 -2.478235 0.414428
H  7.943639 -0.761784 -0.576131
H  7.88015 0.940338 -1.111706
H  8.676063 0.51917 0.432225
H  -1.202754 -0.138069 0.842714
H  -1.037312 1.640042 0.559574
H  -1.914521 1.302473 -1.80943
H  -2.199464 -0.44533 -1.417673
H  -5.016726 2.628823 1.001346
H  -5.77089 2.289549 -0.562102
H  -6.772508 2.263757 0.927585
H  -7.310711 -0.019082 1.680029
H  -6.072832 -1.401262 1.38233
