program: Gaussian 09
title: 000229994
version: EM64L-G09RevD.01
frameworkgroup: C1[X(C9H16O3)]
method: RPBEPBE
basis: SDD
operation: Freq
keyword: #pfreq=noraman
keyword: PBEPBE/SDD
title: #p freq=noraman PBEPBE/SDD
converged: YES YES NO NO
title: Mulliken charges:
elementType: O O O C C C C C C C C C H H H H H H H H H H H H H H H H
charge: -0.297154 -0.268648 -0.255507 0.051924 -0.405002 -0.302539 -0.715463 -0.506338 0.157764 0.343727 -0.755129 -0.635898 0.180843 0.219855 0.230672 0.217810 0.259560 0.217468 0.227801 0.219689 0.197771 0.233225 0.206582 0.241994 0.240125 0.212772 0.227905 0.254190
chargesum: 0.00000
title: Mulliken charges with hydrogens summed into heavy atoms:
elementType: O O O C C C C C C C C C
charge: -0.297154 -0.268648 -0.255507 0.232767 0.045525 0.174831 -0.050506 0.131240 0.157764 0.343727 -0.060237 -0.153803
polarizability: 1.46670828e+02 -1.22782724e+01 1.01089393e+02 -3.02484320e+00 -5.52961375e+00 8.23015173e+01
1716.lowfreq: -12.7885 -7.1114 -0.0009 -0.0006 0.0006 4.5932 25.6797 35.9424 47.8793
frequency: 25.4105 35.4442 47.8023 66.9799 74.7883 98.8896 157.5862 169.9781 180.5018 198.0909 223.0125 253.3337 290.2277 347.2588 362.9291 378.3946 410.4841 449.5803 481.2818 534.7254 588.6365 636.0840 740.6753 761.9036 785.1362 818.2514 906.9227 914.9688 954.1204 961.8773 987.7038 1009.8229 1019.7722 1053.1198 1053.8249 1093.4037 1109.0655 1114.9491 1116.8863 1140.3887 1167.5677 1225.7615 1277.2017 1287.4266 1291.8582 1329.1405 1345.1841 1372.5877 1380.8243 1397.1455 1415.3486 1435.5766 1449.4298 1455.0972 1455.9206 1461.1513 1465.3100 1471.8250 1477.4430 1480.3107 1606.2538 1654.5997 2910.0296 2929.7223 2984.3822 2990.4751 3006.7846 3007.8201 3024.8623 3069.7885 3074.9280 3080.1574 3088.9507 3097.1093 3097.1322 3103.1771 3132.6678 3214.8593
redmass: 3.6239 3.3861 3.5855 3.8804 2.4394 3.3546 2.2240 1.0499 1.0741 2.6706 1.5847 2.7085 3.0364 4.0196 3.1519 2.7363 3.6804 3.1740 3.2081 3.3994 3.6726 1.5533 2.0925 4.1598 2.0809 1.5792 2.1633 2.7142 2.3902 1.5628 1.3188 1.3901 3.6178 1.9349 2.8364 2.0876 1.5319 2.1276 2.7090 1.8833 1.6526 1.3557 1.2970 1.1137 3.3932 1.2207 1.4188 1.4739 1.2326 1.1661 1.2519 1.1337 1.0888 1.0551 1.0451 1.0891 1.0617 1.0603 1.0512 1.0552 9.8361 5.1526 1.0833 1.0351 1.0362 1.0360 1.0649 1.0951 1.0632 1.1016 1.0970 1.0987 1.1002 1.0977 1.1007 1.0619 1.1028 1.1155
irintensity: 1.0564 1.7007 4.1911 0.1772 4.4624 0.1344 1.3046 0.8925 0.8979 1.0723 4.5584 2.8483 9.3094 12.9817 6.1377 1.0491 1.5922 5.1465 5.4645 1.6886 2.5226 11.5682 1.3295 13.0821 9.0060 2.6379 25.0326 8.5163 16.8325 1.6575 59.8006 15.1422 26.2875 26.2752 35.9509 66.7690 34.5357 146.3089 244.3004 10.8760 18.7980 18.4120 5.5727 2.9043 86.6486 14.0983 22.5271 11.4467 18.2305 23.3392 11.9659 2.5137 2.5356 7.4745 15.8820 16.0156 9.3058 40.0792 6.8279 15.9466 125.8282 3.0961 49.1381 87.2084 15.1913 17.4748 3.0745 82.2120 35.4539 5.7526 16.4025 44.2322 32.1179 31.4118 27.7913 5.3609 10.9710 6.2669
temp: 298.150 k
press: 1.00000 atm
elementType: 8 8 8 6 6 6 6 6 6 6 6 6 1 1 1 1 1 1 1 1 1 1 1 1 1 1 1 1
symmnumber: 1
zpe: 617691.9 jmol-1
zpe.correction: 0.235266 hartree
zpe.thermalcorrener: 0.250196 hartree
zpe.thermalcorrenthalpy: 0.251140 hartree
zpe.thermalcorrgfe: 0.191464 hartree
zpe.sumelectzpe: -577.227211 hartree
zpe.sumelectthermal: -577.212281 hartree
zpe.sumelectthermalent: -577.211337 hartree
zpe.sumelectthermalfe: -577.271013 hartree
dipole: 1.3337 -0.2578 0.5192
dipole: 1.4542
quadrupole: -56.6474 -76.0218 -74.1578
quadrupole: 4.3869 -6.0938 2.8748
quadrupole: 12.2949 -7.0794 -5.2155 4.3869 -6.0938 2.8748
hfenergy: -577.4624773 hartree
pointgroup: C01 [X(C9H16O3)]
dipole: 0.53076 0.157616 0.1441994 debye
polarizability: 145.7755122|-8.2502832|81.5409937|12.0725673|1.0623075|102.7452332 unknown
InChI: InChI=1S/C9H16O3/c1-7(2)9(10)12-6-5-8(3)11-4/h8H,1,5-6H2,2-4H3
charge 0 multiplicity 1
28 atoms
O  3.275999 -0.167672 0.82809
O  -0.944392 -0.006754 0.682459
O  -1.517095 -0.547793 -1.515676
C  2.726445 0.221681 -0.490489
C  1.278238 0.664932 -0.217109
C  0.451531 -0.463736 0.414936
C  3.557554 1.334351 -1.156213
C  4.53748 -0.901651 0.754605
C  -1.842334 -0.097916 -0.387038
C  -3.203921 0.397703 0.011461
C  -3.410355 0.914499 1.419906
C  -4.183554 0.351286 -0.933212
H  2.719289 -0.679998 -1.14873
H  1.292619 1.538481 0.461004
H  0.813185 0.973304 -1.171145
H  0.411969 -1.344929 -0.251479
H  0.846446 -0.740987 1.402268
H  4.590914 1.004937 -1.36567
H  3.601352 2.222125 -0.500152
H  3.100451 1.631529 -2.11786
H  4.454402 -1.785031 0.084853
H  4.751086 -1.241952 1.780579
H  5.376305 -0.265662 0.404706
H  -3.180447 0.132514 2.165525
H  -2.730531 1.758122 1.635538
H  -4.451294 1.250109 1.564894
H  -5.201334 0.694218 -0.717754
H  -3.970406 -0.03461 -1.936099
