program: Gaussian 09
title: 000229993
version: EM64L-G09RevD.01
frameworkgroup: C1[X(C8H12O2)]
method: RPBEPBE
basis: SDD
operation: Freq
keyword: #pfreq=noraman
keyword: PBEPBE/SDD
title: #p freq=noraman PBEPBE/SDD
converged: YES YES NO NO
title: Mulliken charges:
elementType: O O C C C C C C C C H H H H H H H H H H H H
charge: -0.278403 -0.253901 -0.459697 0.565718 -0.798424 0.348452 0.177554 -0.754568 -0.722615 -0.632466 0.231111 0.247225 0.237650 0.235637 0.227454 0.241030 0.241846 0.213786 0.223184 0.225117 0.228950 0.255359
chargesum: 0.00000
title: Mulliken charges with hydrogens summed into heavy atoms:
elementType: O O C C C C C C C C
charge: -0.278403 -0.253901 0.018640 0.565718 -0.097683 0.348452 0.177554 -0.057906 -0.274315 -0.148156
polarizability: 1.34021732e+02 1.96158593e+01 8.59864323e+01 -8.74191960e+00 -3.18388046e+00 6.62168015e+01
1716.lowfreq: -6.4188 -0.0006 0.0005 0.0006 7.6162 12.4081 37.4370 57.0904 65.4076
frequency: 36.2714 57.0177 65.2977 75.3760 172.4896 176.3854 199.1283 256.4316 283.5368 366.8174 382.8885 404.2009 410.9054 465.7526 556.7491 585.6218 632.7352 700.6812 767.8719 783.0082 822.3750 898.8619 945.7719 955.1705 968.2418 985.3375 989.4656 1009.2663 1035.3886 1052.2779 1070.4931 1105.0233 1235.8379 1287.2172 1304.5260 1348.5791 1396.4866 1398.3131 1415.6937 1432.0845 1452.2298 1456.0131 1464.8738 1471.8214 1479.6171 1609.1056 1653.6482 1672.9916 2976.3178 2990.3680 3006.8584 3053.5851 3074.1833 3091.8554 3094.0513 3097.9428 3099.4176 3104.1031 3195.5566 3215.9935
redmass: 3.2477 3.3067 3.7772 4.4760 1.2081 1.0588 2.2627 4.0809 4.2693 3.1674 3.0083 2.4018 2.5015 2.7246 3.6780 2.9747 1.5682 1.2195 5.0210 2.0424 3.1795 4.7392 1.8706 1.3961 1.3421 1.8532 1.3162 1.3935 1.4958 1.5049 1.7563 4.5704 1.1618 3.2544 2.7795 1.3565 1.1779 1.2256 1.2493 1.1727 1.0846 1.0461 1.0700 1.0601 1.0696 10.0993 5.1439 4.9999 1.0371 1.0361 1.0603 1.0966 1.0970 1.0663 1.0965 1.1008 1.1032 1.0619 1.1140 1.1155
irintensity: 0.6470 1.0651 3.0748 0.0700 0.9741 0.8094 2.3372 4.2994 4.4754 8.3604 2.3174 5.6827 1.6738 2.5311 10.9115 2.3218 11.8604 0.4658 5.0613 8.7478 3.6699 53.1067 28.9338 59.0016 1.4206 35.4089 59.5248 12.1495 14.0542 6.7797 6.7259 400.1716 8.5358 82.0831 1.7114 7.9157 28.7802 16.3865 12.2611 3.6006 7.1736 12.3970 34.7997 38.9471 26.9134 131.4388 3.3895 21.0571 16.8699 16.4385 27.2753 17.9104 15.8898 14.4299 24.8009 26.7430 8.2377 5.1002 20.9682 5.6649
temp: 298.150 k
press: 1.00000 atm
elementType: 8 8 6 6 6 6 6 6 6 6 1 1 1 1 1 1 1 1 1 1 1 1
symmnumber: 1
zpe: 474296.1 jmol-1
zpe.correction: 0.180650 hartree
zpe.thermalcorrener: 0.192338 hartree
zpe.thermalcorrenthalpy: 0.193282 hartree
zpe.thermalcorrgfe: 0.142166 hartree
zpe.sumelectzpe: -461.684419 hartree
zpe.sumelectthermal: -461.672731 hartree
zpe.sumelectthermalent: -461.671787 hartree
zpe.sumelectthermalfe: -461.722903 hartree
dipole: 0.0667 1.5968 0.5494
dipole: 1.6900
quadrupole: -52.1361 -64.6419 -59.0730
quadrupole: -1.8808 -2.0563 -2.2647
quadrupole: 6.4809 -6.0249 -0.4560 -1.8808 -2.0563 -2.2647
hfenergy: -461.8650688 hartree
pointgroup: C01 [X(C8H12O2)]
dipole: -0.0731431 0.5282292 0.3971221 debye
dipolederiv: -1.538121 -0.0109411 0.4048427 -0.1049736 -0.3921796 -0.0608146 0.4584126 -0.0602051 -0.5647473 -0.7011795 -0.1414371 0.000693 -0.0548493 -0.6877333 -0.3105045 0.1309377 -0.2813477 -0.6168297 0.8515015 0.0483574 -0.0991594 0.3674088 0.2603145 -0.075126 0.1316336 -0.0233416 0.1713449 0.149237 -0.0786868 -0.0900556 -0.1369413 -0.0329145 -0.0808835 -0.0955629 -0.1050628 0.2524626 -0.0268375 -0.0043287 0.064043 0.0474227 0.0103236 0.0687478 0.0388693 0.077281 -0.1321434 -0.4046791 -0.152741 0.0193473 -0.1461968 0.0675499 0.20518 0.0801835 0.2013239 0.1445549 1.7301153 0.2364041 -0.4293961 0.1680951 0.6901306 0.3324422 -0.6581394 0.3402742 0.7998879 0.0096392 0.0287179 0.0543144 0.0131918 -0.0274195 -0.1104383 0.0545364 -0.1136582 -0.0751914 -0.2483594 -0.1358123 0.0826523 -0.1112147 -0.3003658 -0.1652135 -0.0163599 -0.152276 -0.0975656 -0.0384907 0.1796298 0.0034871 0.0327077 -0.1689846 0.1250152 -0.1396511 0.0605073 -0.2029629 -0.0215965 -0.0318133 0.0469412 -0.0436255 0.0773242 0.0496845 0.0058691 0.1011341 -0.0966176 0.0103663 0.0618537 0.0225121 -0.0594721 -0.0010263 -0.0214437 -0.0803861 -0.1062476 0.0685079 0.1148598 0.0603909 0.0511921 0.0329968 -0.0194061 -0.1001085 0.0769603 -0.0544679 -0.0080331 -0.0122045 -0.130206 0.0156884 -0.143493 0.0061173 0.0295618 0.0261595 -0.0187816 0.0542534 -0.0933488 0.103964 -0.1025165 0.0887813 0.060092 0.0628005 -0.0375191 0.043733 0.0478208 0.0004237 0.1256202 -0.0319921 0.1166077 0.0174863 -0.0189645 -0.0268988 0.0196721 0.0772255 0.1326062 -0.0194819 0.0333191 0.009123 0.0444983 0.0819086 0.0346799 0.0465241 -0.0793683 -0.1048479 -0.1487291 -0.0325513 -0.0982427 0.0156069 -0.0429231 0.0257665 -0.0086927 0.0854146 0.1021044 0.0368716 0.0091657 0.0163252 0.1318928 0.1214413 0.036432 0.1075846 -0.076469 -0.028757 0.0980393 -0.0357315 0.1410087 0.1145988 0.0640877 -0.0527574 0.0847512 0.0531353 -0.0243194 -0.0981173 0.0040273 -0.1205675 0.0601248 -0.0416181 -0.0138808 -0.0530235 0.1237401 0.1418878 -0.0275544 0.0091769 -0.0140923 0.0739697 -0.1128314 0.020715 -0.1056809 0.0715805 unknown
polarizability: 132.8544153|3.2875922|69.5118552|-23.2652797|5.6656403|83.8586957 unknown
InChI: InChI=1S/C8H12O2/c1-6(2)5-10-8(9)7(3)4/h1,3,5H2,2,4H3
charge 0 multiplicity 1
22 atoms
O  -0.096845 -0.008317 0.678707
O  0.848756 -1.205167 -1.096143
C  -1.343156 -0.839246 0.58678
C  -2.480755 -0.02901 -0.001032
C  -2.255361 0.535592 -1.389327
C  2.113528 0.600239 0.002515
C  0.933894 -0.30178 -0.226837
C  2.039477 1.638375 1.102513
C  -3.638552 0.129294 0.692903
C  3.195208 0.423539 -0.805885
H  -1.55382 -1.148192 1.622868
H  -1.109931 -1.719328 -0.04252
H  -1.938846 -0.257119 -2.09347
H  -1.44471 1.289033 -1.377344
H  -3.165231 1.018794 -1.782757
H  1.190676 2.326967 0.942618
H  1.871669 1.162252 2.085143
H  2.971634 2.226694 1.147397
H  -3.766806 -0.276111 1.703877
H  -4.494281 0.663843 0.265349
H  4.093354 1.041515 -0.699355
H  3.188496 -0.346965 -1.584499
