program: Gaussian 09
title: 000229991
version: EM64L-G09RevD.01
frameworkgroup: C1[X(C5H7BrO2)]
method: RPBEPBE
basis: SDD
operation: Freq
keyword: #p
keyword: freq=noraman
keyword: PBEPBE/SDD
title: #p freq=noraman PBEPBE/SDD
converged: YES YES NO NO
title: Mulliken charges:
elementType: Br O O C C C C C H H H H H H H
charge: 0.048527 -0.282615 -0.223606 -0.221805 -0.672654 0.362573 -0.189785 -0.472123 0.234733 0.234727 0.216442 0.231137 0.231138 0.242618 0.260691
chargesum: 0.00000
title: Mulliken charges with hydrogens summed into heavy atoms:
elementType: Br O O C C C C C
charge: 0.048527 -0.282615 -0.223606 0.247655 0.006063 0.362573 -0.189785 0.031186
polarizability: 1.03474137e+02 8.18924939e+00 8.30520198e+01 1.25427101e-03 1.76764481e-03 3.90671384e+01
1716.lowfreq: -4.6685 -0.0008 -0.0007 -0.0006 4.4098 6.2855 38.2848 72.0702 114.1257
frequency: 37.1613 71.7874 114.1165 118.0666 199.9433 242.9421 306.9059 330.1102 369.0257 380.5966 555.1609 630.3750 658.3185 756.8482 801.1856 807.7144 887.7866 957.0026 1021.6521 1056.7688 1112.7827 1135.3151 1199.6298 1250.1848 1354.3327 1389.7475 1403.1808 1463.9593 1474.0551 1486.3649 1599.3890 1635.8209 2997.8522 3012.9179 3072.2354 3094.3361 3109.7569 3117.8772 3233.7903
redmass: 4.6777 3.3857 2.2578 4.5487 7.8488 1.2126 5.4463 3.2257 5.8512 3.8118 6.7450 1.3800 4.1136 2.7902 1.1121 4.0676 3.1646 1.3426 2.1271 3.2537 2.2218 1.4561 4.2927 1.1349 1.3216 1.2005 1.2716 1.0398 1.0610 1.0692 6.5374 9.3535 1.0359 1.0583 1.1068 1.0984 1.1028 1.0611 1.1161
irintensity: 0.0178 0.4276 6.8958 1.4119 0.7856 1.0015 13.2772 2.0305 0.2861 2.8174 9.8543 9.4976 19.4334 14.6990 2.5369 6.3635 15.9012 62.7017 14.7420 451.0691 4.1360 6.0242 61.2703 0.0036 11.4382 40.6895 23.4998 12.6947 4.9878 14.6105 126.4223 97.2274 18.0862 15.8775 6.6164 26.3585 43.5501 1.9928 1.1678
temp: 298.150 k
press: 1.00000 atm
elementType: 35 8 8 6 6 6 6 6 1 1 1 1 1 1 1
symmnumber: 1
zpe: 289777.4 jmol-1
zpe.correction: 0.110370 hartree
zpe.thermalcorrener: 0.119779 hartree
zpe.thermalcorrenthalpy: 0.120723 hartree
zpe.thermalcorrgfe: 0.073861 hartree
zpe.sumelectzpe: -357.988110 hartree
zpe.sumelectthermal: -357.978702 hartree
zpe.sumelectthermalent: -357.977758 hartree
zpe.sumelectthermalfe: -358.024620 hartree
dipole: 2.8071 2.4629 0.0001
dipole: 3.7344
quadrupole: -45.7800 -56.9147 -57.2145
quadrupole: -2.5929 0.0000 -0.0006
quadrupole: 7.5231 -3.6117 -3.9114 -2.5929 0.0000 -0.0006
hfenergy: -358.0984807 hartree
pointgroup: C01 [X(C5H7Br1O2)]
dipole: 1.0219005 -1.0556149 -0.0000226 debye
dipolederiv: -0.469478 0.2740599 -0.0000099 0.1844918 -0.1493987 0.0000088 -0.0000109 -0.0000126 0.0064099 -1.7675977 0.1157029 0.000098 0.1684098 -0.4820799 -0.0000042 0.0002264 -0.0000623 -0.2790742 -0.6163895 -0.1193711 0.000001 0.1861281 -0.8804421 -0.0001079 -0.0000101 0.0000294 -0.3109496 0.9677196 0.0336 -0.0000522 0.2095997 0.2468879 -0.0000213 -0.0001665 0.0000912 0.3553883 -0.1365769 0.0747462 0.0000218 0.0422491 0.0059307 -0.0000264 0.0000105 -0.0000075 0.0621473 1.6011248 0.1866793 -0.0000664 -0.1273256 1.1732719 0.0001565 -0.0000646 0.0000685 0.2982075 0.6196896 -0.606972 0.0000563 -0.8344033 0.0685076 -0.0000568 -0.0000369 -0.0000166 -0.1512625 -0.2441758 0.1392088 0.0000113 0.2528636 -0.2074191 0.0000325 -0.0000255 0.0000101 -0.2420788 -0.0496523 0.0246328 -0.030502 -0.0587267 0.0023881 0.086482 0.007264 0.0975981 -0.0545836 -0.0496909 0.0246238 0.0304982 -0.0587366 0.0024154 -0.0864713 -0.0071915 -0.0976782 -0.054648 -0.1265228 -0.0791183 0.000019 -0.0967723 0.0320594 0.0000031 0.0000232 -0.0000044 0.1187887 0.1136383 -0.013971 0.028474 0.0450542 0.0094597 0.1048291 0.0009462 0.1123798 -0.0618533 0.1136317 -0.0139914 -0.028516 0.0450224 0.0095214 -0.1048171 -0.0009669 -0.1123667 -0.0618964 0.0001095 -0.0707796 -0.000016 -0.0751895 0.0806633 -0.0000088 0.0000169 -0.000016 0.1770956 0.0441702 0.0309496 -0.0000171 0.1173353 0.0882345 0.0000017 -0.0000142 -0.0000129 0.198309 unknown
polarizability: 102.0107453|-9.7369318|84.5154112|-0.0011063|0.0018638|39.0671384 unknown
InChI: InChI=1S/C5H7BrO2/c1-3-8-5(7)4(2)6/h2-3H2,1H3
charge 0 multiplicity 1
15 atoms
Br -3.164036 0.494868 -0.000131
O  0.925457 -0.316649 0.000016
O  -0.261795 1.692638 0.000107
C  2.199744 0.470787 -0.000063
C  3.340515 -0.540132 -0.000343
C  -0.24824 0.442149 0.00019
C  -1.454626 -0.451948 0.000037
C  -1.407864 -1.806375 0.000029
H  2.202884 1.118893 -0.894968
H  2.203127 1.118666 0.895006
H  4.308096 -0.006047 -0.000399
H  3.300451 -1.183286 0.895224
H  3.300217 -1.183053 -0.896068
H  -2.311911 -2.421118 -0.000064
H  -0.431918 -2.302993 0.000129
