program: Gaussian 09
title: 000229990
version: EM64L-G09RevD.01
frameworkgroup: C1[X(C4H5BrO2)]
method: RPBEPBE
basis: SDD
operation: Freq
keyword: #p
keyword: freq=noraman
keyword: PBEPBE/SDD
title: #p freq=noraman PBEPBE/SDD
converged: YES YES NO YES
title: Mulliken charges:
elementType: Br O O C C C C H H H H H
charge: 0.051192 -0.282717 -0.219467 0.342697 -0.496066 -0.164951 -0.466507 0.235513 0.247276 0.247290 0.243112 0.262629
chargesum: 0.00000
title: Mulliken charges with hydrogens summed into heavy atoms:
elementType: Br O O C C C C
charge: 0.051192 -0.282717 -0.219467 0.342697 0.234012 -0.164951 0.039234
polarizability: 8.46833074e+01 7.66433873e+00 7.51007068e+01 -2.41705436e-03 1.75217450e-03 2.97840913e+01
1716.lowfreq: -9.0351 0.0005 0.0005 0.0010 4.1634 5.7324 41.9581 89.8414 138.3414
frequency: 41.9352 89.8398 138.3385 156.4096 256.3301 329.9823 341.5517 369.7394 543.3334 628.4374 665.9412 756.9879 803.2679 943.9284 958.9579 1066.6331 1112.8656 1146.3930 1204.3039 1387.0889 1423.6667 1450.5347 1463.2854 1600.3547 1641.8270 3006.9160 3110.2334 3117.8249 3152.6748 3233.9480
redmass: 4.5600 1.1675 3.3493 5.7806 6.2455 2.9651 6.3039 5.9894 7.0949 1.3764 3.7713 2.9037 4.9570 3.5986 1.3439 3.1703 1.2591 1.4302 4.6031 1.1770 1.1749 1.0498 1.0517 6.1705 9.2423 1.0294 1.1048 1.0610 1.1050 1.1162
irintensity: 0.2126 0.8798 9.8139 1.2651 6.5642 2.1787 13.1989 0.1557 8.4837 10.5303 19.7719 13.8716 19.8206 3.0484 64.2150 324.0177 0.0357 15.7380 43.3812 31.5857 25.4429 15.1718 12.5651 113.3174 109.1624 29.5966 24.1838 2.1596 13.1822 1.1479
temp: 298.150 k
press: 1.00000 atm
elementType: 35 8 8 6 6 6 6 1 1 1 1 1
symmnumber: 1
zpe: 216186.3 jmol-1
zpe.correction: 0.082341 hartree
zpe.thermalcorrener: 0.090494 hartree
zpe.thermalcorrenthalpy: 0.091438 hartree
zpe.thermalcorrgfe: 0.047683 hartree
zpe.sumelectzpe: -318.758852 hartree
zpe.sumelectthermal: -318.750699 hartree
zpe.sumelectthermalent: -318.749755 hartree
zpe.sumelectthermalfe: -318.793509 hartree
dipole: 2.2845 2.5248 0.0005
dipole: 3.4049
quadrupole: -38.6673 -50.3547 -50.9952
quadrupole: -0.8787 0.0006 -0.0018
quadrupole: 8.0051 -3.6823 -4.3228 -0.8787 0.0006 -0.0018
hfenergy: -318.8411927 hartree
pointgroup: C01 [X(C4H5Br1O2)]
dipole: 0.6986122 -1.1430044 -0.0002023 debye
dipolederiv: -0.3581444 0.3079231 -0.0000572 0.2172965 -0.2356319 0.0000212 -0.0000922 0.0000461 0.008612 -1.4528375 0.2094702 0.00021 0.3485499 -0.5507651 -0.0000945 0.0006045 -0.0002414 -0.296988 -0.591646 -0.1856247 -0.0000684 0.0932251 -0.8699126 -0.0004283 0.0000218 0.0000559 -0.3125058 1.5192511 0.1540119 -0.0001097 -0.1426914 1.1527398 0.0005947 -0.0002817 0.0003471 0.3083344 0.6941333 -0.0143405 -0.0000909 0.0993642 0.2088746 -0.0000484 -0.0000554 -0.000062 0.2810342 0.3438544 -0.662364 0.0001291 -0.8724807 0.3209609 -0.0001319 -0.0000472 -0.0001884 -0.1490626 -0.1633395 0.126663 0.0000658 0.2522522 -0.2690088 0.0000816 -0.0000202 0.0000381 -0.2430508 -0.0241246 0.0688992 0.000072 0.1176427 -0.0305099 -0.0001286 0.0001053 -0.0000937 0.1246099 -0.0078426 0.008174 0.009772 -0.0843261 0.051141 -0.0987279 -0.0418409 -0.0799261 -0.0510558 -0.0077937 0.0082614 -0.0098366 -0.0842524 0.0509118 0.0988636 0.0416755 0.0800423 -0.0508561 -0.0190623 -0.051549 -0.0000568 -0.0565317 0.1037108 -0.0000113 -0.0000076 -0.0000137 0.1776594 0.0675518 0.0304754 -0.0000293 0.1119517 0.0674894 0.0000096 -0.000062 -0.0000042 0.2032693 unknown
polarizability: 81.5546369|-8.8844982|78.2293773|0.0027005|0.0012727|29.7840913 unknown
InChI: InChI=1S/C4H5BrO2/c1-3(5)4(6)7-2/h1H2,2H3
charge 0 multiplicity 1
12 atoms
Br -2.562468 0.884809 -0.000181
O  1.317728 -0.637878 -0.00016
O  0.50849 1.549531 0.000491
C  0.295534 0.318066 0.000582
C  2.693922 -0.084232 -0.000401
C  -1.04799 -0.349438 0.000139
C  -1.240714 -1.691045 -0.000019
H  3.348404 -0.966684 -0.001126
H  2.855559 0.533191 0.898941
H  2.854871 0.534158 -0.899201
H  -2.239671 -2.135394 -0.000307
H  -0.368266 -2.352784 0.000143
