program: Gaussian 09
title: 000229989
version: EM64L-G09RevD.01
frameworkgroup: C1[X(C9H10N4O)]
method: RPBEPBE
basis: SDD
operation: Freq
keyword: #p
keyword: freq=noraman
keyword: PBEPBE/SDD
title: #p freq=noraman PBEPBE/SDD
converged: YES YES NO NO
title: Mulliken charges:
elementType: O N N N N C C C C C C C C C H H H H H H H H H H
charge: -0.215248 -0.246599 -0.037816 -0.019083 -0.086892 0.156926 0.211864 0.044025 -0.317963 -0.297691 -0.590420 -0.590412 -0.221344 -0.202539 0.277861 0.228561 0.224922 0.242019 0.224945 0.228514 0.242037 0.264246 0.239875 0.240214
chargesum: 0.00000
title: Mulliken charges with hydrogens summed into heavy atoms:
elementType: O N N N N C C C C C C C C C
charge: -0.215248 -0.246599 -0.037816 -0.019083 -0.086892 0.156926 0.211864 0.044025 -0.040102 -0.033445 0.105083 0.105083 0.018530 0.037675
polarizability: 1.98559024e+02 2.60964251e+00 1.29246258e+02 -1.78507749e-03 -9.82700433e-03 6.77777206e+01
1716.lowfreq: -42.3188 -7.1754 -4.3935 -0.0003 0.0001 0.0005 8.9520 54.4180 115.7132
frequency: -42.2426 54.4112 115.7131 138.6924 178.2078 198.3318 202.3365 219.0459 274.7181 283.6467 387.8238 414.8804 426.0223 447.8475 471.2822 519.2033 534.5618 548.1465 606.9376 657.3143 677.2284 726.0840 773.6228 790.4654 816.5738 870.8577 902.1857 904.8595 955.8953 984.2235 1009.2667 1018.1695 1024.0189 1077.0323 1096.1007 1115.9919 1159.6287 1169.9887 1191.5550 1222.0224 1227.9858 1255.8897 1275.2595 1373.3224 1406.8750 1412.4996 1432.8399 1443.0752 1452.7721 1460.2029 1466.2771 1474.4328 1486.7912 1567.5803 1612.3560 1631.0640 2940.1830 2946.1531 3055.0816 3056.8491 3102.1395 3106.7759 3141.2928 3155.4038 3169.1045 3178.6229
redmass: 3.0586 4.9156 4.8311 2.8683 3.9657 1.1243 1.1397 5.3983 4.8315 3.5804 4.4904 3.7647 4.3627 4.1328 8.6397 4.2871 7.4478 8.6882 5.1166 6.6633 4.5823 7.1138 4.4892 1.4055 6.9502 6.8377 1.4344 10.9376 4.0481 1.3758 1.3423 1.6327 2.0874 1.2192 2.2686 1.6623 1.6965 1.3637 2.3861 2.8134 3.8648 3.1362 1.7049 8.7199 8.8901 1.1370 1.1714 2.4510 1.0476 2.7603 1.0655 1.0484 1.0523 7.0137 6.6734 12.2454 1.0439 1.0444 1.0884 1.0883 1.1013 1.1017 1.0865 1.0904 1.0955 1.1001
irintensity: 0.1180 5.7307 0.4245 9.0584 0.8193 0.0347 0.6228 1.3627 5.8318 1.3481 0.9620 0.8002 0.5001 0.3316 5.6919 0.3341 10.9666 9.4465 4.4930 2.1615 28.7827 20.0656 11.1340 67.1945 14.7722 14.6144 0.1586 32.8532 69.4195 2.9803 0.1004 14.9956 0.3829 2.2745 2.6109 24.0784 48.2519 16.1584 0.0622 13.5535 2.5665 11.5550 9.4054 19.4248 6.8176 4.5545 4.1633 21.7158 12.9011 1.9293 19.9052 3.8538 17.3689 10.1113 13.3236 232.0654 45.1344 82.0388 5.9581 46.7055 11.7555 39.8362 3.5767 6.3352 5.6583 18.4041
temp: 298.150 k
press: 1.00000 atm
elementType: 8 7 7 7 7 6 6 6 6 6 6 6 6 6 1 1 1 1 1 1 1 1 1 1
symmnumber: 1
zpe: 478480.7 jmol-1
zpe.correction: 0.182244 hartree
zpe.thermalcorrener: 0.193793 hartree
zpe.thermalcorrenthalpy: 0.194737 hartree
zpe.thermalcorrgfe: 0.144863 hartree
zpe.sumelectzpe: -642.099605 hartree
zpe.sumelectthermal: -642.088056 hartree
zpe.sumelectthermalent: -642.087111 hartree
zpe.sumelectthermalfe: -642.136985 hartree
dipole: -1.6946 -0.8521 0.0016
dipole: 1.8968
quadrupole: -58.0638 -92.9212 -80.1590
quadrupole: -3.4260 0.0026 0.0061
quadrupole: 18.9842 -15.8732 -3.1110 -3.4260 0.0026 0.0061
hfenergy: -642.2818487 hartree
pointgroup: C01 [X(C9H10N4O1)]
dipole: 0.6682787 -0.3320669 -0.003713 debye
dipolederiv: -0.4710686 0.136849 0.0014275 0.2458443 -1.0877729 -0.0084706 0.0027147 -0.008676 -0.3316393 0.378875 -0.4082709 -0.0041137 0.499818 -0.7950245 -0.0063576 0.006808 -0.0072345 -0.1849507 -0.1681279 -0.0711269 -0.0007817 -0.2174659 -0.4211167 -0.001908 -0.0029416 -0.0017031 -0.2830703 -0.0332515 -0.4061437 -0.0045718 -0.6838038 0.4738052 0.0062934 -0.0076577 0.0063837 -0.1302708 -0.4858477 0.328686 0.0034249 0.3850955 -0.2125789 -0.000001 0.0035174 0.000105 -0.1799926 -0.299877 0.2294479 0.0023877 0.2570616 -0.1457409 -0.0017006 0.0026024 -0.0017335 0.0236563 0.6994605 0.1101788 0.0017324 -0.1160995 1.4272274 0.0134547 -0.000334 0.0136596 0.2507943 0.2598536 0.0500626 0.0007519 -0.2313145 -0.020116 -0.0016431 -0.0023414 -0.0014484 0.1050057 -0.2353808 -0.1584004 -0.0019759 0.0173544 0.0584084 0.0020202 -0.0000614 0.0018836 -0.113596 -0.2053444 -0.0434367 -0.0006163 -0.1169826 0.1413232 0.0028759 -0.0013919 0.0029749 -0.1169993 0.1192306 0.0272417 -0.1567115 0.0739261 0.3044079 -0.0317578 -0.3236361 -0.0795258 0.2714113 0.1179978 0.0232359 0.1570397 0.0646195 0.3017083 0.0326622 0.3250068 0.0804187 0.2752361 0.0972701 0.1973435 0.002519 0.035098 -0.0083882 0.0015275 0.0006266 0.0016891 -0.1379042 0.1914214 -0.0699404 -0.0005026 -0.0446173 0.0112344 0.0017506 -0.000213 0.0017097 -0.1415415 0.1045265 0.0502508 0.0005344 -0.0168857 0.0047753 -0.0017765 -0.0002531 -0.0017077 0.1559858 0.0701768 0.0070385 0.0521146 -0.1010222 -0.1671366 0.1024483 0.0638164 -0.0103136 0.0069776 -0.1751745 0.0641473 0.0397222 0.0816864 0.0655972 0.0198353 0.0115453 0.0301388 0.0928159 0.0820898 -0.054142 -0.1124567 -0.0601751 0.052971 -0.051154 -0.065902 -0.0370791 -0.0702549 -0.1750267 0.0651698 -0.0387149 0.0819722 0.0668629 -0.0203012 -0.0100798 -0.0306363 0.0914713 0.0701397 0.0083878 -0.0518008 -0.0990123 -0.164858 -0.1069976 -0.0663177 0.0060784 0.0042819 0.0816787 -0.0570103 0.1114046 -0.0618301 0.0507175 0.0540372 0.0648553 0.0398964 -0.0675488 0.1057957 -0.0052735 -0.0001111 0.0429412 -0.0309162 -0.0022065 0.0004643 -0.0022527 0.1625208 -0.0343319 -0.0885666 -0.0012127 -0.1003325 0.018202 -0.0017465 -0.001333 -0.0017451 0.1600613 -0.0950853 0.0642716 0.0005109 0.0641243 0.0764082 -0.0008844 0.0005055 -0.0008821 0.1575502 unknown
polarizability: 198.581925|-2.2845873|129.2151327|0.1060973|0.7050918|67.785945 unknown
InChI: InChI=1S/C9H10N4O/c1-12(2)13-9(14)7-5-3-4-6-8(7)10-11-13/h3-6H,1-2H3
charge 0 multiplicity 1
24 atoms
O  -0.785352 2.223936 0.023033
N  -1.415663 -0.063042 -0.004065
N  -2.797824 0.243452 -0.00185
N  -1.114215 -1.47173 -0.020115
N  0.131319 -1.865058 -0.023372
C  0.933838 0.502841 0.004837
C  -0.458849 1.010297 0.009194
C  1.180748 -0.903518 -0.011214
C  2.025186 1.406479 0.016422
C  2.513008 -1.396465 -0.015696
C  -3.471593 -0.188174 1.245355
C  -3.468625 -0.156999 -1.260984
C  3.34233 0.912414 0.011913
C  3.586096 -0.49004 -0.004189
H  1.810688 2.479688 0.0287
H  -3.534589 -1.292843 1.348151
H  -4.490774 0.234829 1.24221
H  -2.930408 0.227208 2.111239
H  -4.487856 0.265745 -1.249734
H  -3.53122 -1.258797 -1.391299
H  -2.925454 0.279759 -2.115026
H  2.665312 -2.479882 -0.028146
H  4.186631 1.609716 0.020808
H  4.615763 -0.862618 -0.007568
