program: Gaussian 09
title: 000229986
version: EM64L-G09RevD.01
frameworkgroup: C1[X(C12H13Cl2NOS)]
method: RPBEPBE
basis: SDD
operation: Freq
keyword: #p
keyword: freq=noraman
keyword: PBEPBE/SDD
title: #p freq=noraman PBEPBE/SDD
converged: YES YES NO NO
title: Mulliken charges:
elementType: Cl Cl S O N C C C C C C C C C C C C H H H H H H H H H H H H H
charge: -0.060632 -0.043191 -0.047246 -0.236839 -0.034933 -0.374808 -0.357852 -0.301513 -0.301585 -0.236506 -0.608271 0.658224 -0.403673 -0.311143 -0.113566 -0.206790 -0.232537 0.241227 0.250583 0.259514 0.234955 0.197142 0.230345 0.230315 0.208287 0.246447 0.293730 0.292460 0.263323 0.264534
chargesum: 0.00000
title: Mulliken charges with hydrogens summed into heavy atoms:
elementType: Cl Cl S O N C C C C C C C C C C C C
charge: -0.060632 -0.043191 -0.047246 -0.236839 -0.034933 0.117003 0.136617 0.125974 0.137017 -0.236506 -0.068094 0.658224 -0.403673 -0.018684 -0.113566 0.056533 0.031997
polarizability: 1.83163521e+02 -9.67112050e+00 1.99052699e+02 -1.38396593e+01 -1.02138567e+01 1.33123466e+02
1716.lowfreq: -8.9763 -2.1431 0.0012 0.0019 0.0021 5.0224 15.5513 40.9147 49.2663
frequency: 15.5408 40.9106 49.2449 55.5293 85.8001 92.9849 152.7198 173.1058 188.7403 217.0877 283.1905 290.8675 301.1736 308.5385 362.0080 392.5872 395.8549 418.3691 439.3275 461.5791 466.7662 497.4099 521.7814 535.0102 589.0022 612.2165 683.8975 689.2093 738.5204 795.4151 810.3838 826.9990 833.9451 856.4649 900.9005 907.7881 944.9337 956.8032 1006.9645 1008.8112 1024.2208 1045.7211 1069.6255 1082.1219 1095.4444 1109.7433 1130.5538 1159.5899 1188.2111 1195.0180 1206.6541 1249.0263 1258.6919 1265.7751 1276.8722 1302.9109 1326.6105 1339.2197 1347.4573 1367.7402 1369.0406 1381.6200 1441.4793 1446.4602 1448.1013 1449.6348 1456.0903 1469.9880 1490.5811 1561.6260 1595.6693 2952.1721 2965.9177 2989.5122 2995.7960 3020.0984 3066.9933 3077.7857 3087.3237 3094.3045 3114.2990 3140.3825 3163.7290 3183.1207
redmass: 10.6831 5.7898 4.3264 5.4854 7.9028 7.5053 4.9722 11.3365 3.2294 8.3021 3.3938 3.9089 4.5961 24.9855 3.2483 4.9734 2.5826 2.3997 3.1739 3.6411 3.3070 5.0581 7.4313 3.9358 2.7944 3.6795 3.8906 5.7541 4.7457 4.4156 1.3462 1.8788 2.5257 5.2876 2.2186 1.5674 1.4112 2.0119 4.1004 3.0444 2.4663 2.2475 3.5553 1.9490 3.0536 2.5937 1.7313 1.5259 1.1036 2.2909 1.9177 1.3995 1.4037 1.3272 1.2296 1.4159 1.2607 1.2374 1.3538 1.8724 2.4198 3.5387 1.4302 1.4626 1.5155 1.1064 1.0986 1.6962 1.2237 6.6528 8.0883 1.0682 1.0678 1.0611 1.0668 1.0608 1.1015 1.0996 1.0962 1.0984 1.0948 1.0932 1.0890 1.0979
irintensity: 0.2994 0.4400 0.8089 3.8038 0.0122 1.4654 0.5723 0.7432 5.6959 0.9360 8.2219 7.8034 6.8918 0.2253 0.9412 0.3173 3.6636 2.0373 6.0115 10.4241 3.7790 23.4740 18.7946 4.3240 12.0815 3.8080 0.4783 2.6656 1.1746 19.1365 40.0097 0.3527 2.5108 30.1115 3.2128 22.4105 2.8520 15.3276 63.0098 10.0587 53.3062 41.6945 33.7227 36.8164 24.8233 0.8521 4.5957 34.9408 2.3175 22.2544 19.6676 35.4086 39.5002 21.8989 27.5768 27.4652 4.1484 0.9667 3.6667 0.9356 1.6724 11.1495 96.3892 75.4975 39.7327 1.7571 5.2934 115.7762 20.4720 7.8040 12.8332 44.6666 49.6600 20.2434 48.3510 6.0155 16.4996 5.2203 26.9414 26.7589 4.1148 6.5571 0.3840 1.7503
temp: 298.150 k
press: 1.00000 atm
elementType: 17 17 16 8 7 6 6 6 6 6 6 6 6 6 6 6 6 1 1 1 1 1 1 1 1 1 1 1 1 1
symmnumber: 1
zpe: 597602.4 jmol-1
zpe.correction: 0.227615 hartree
zpe.thermalcorrener: 0.243825 hartree
zpe.thermalcorrenthalpy: 0.244770 hartree
zpe.thermalcorrgfe: 0.181115 hartree
zpe.sumelectzpe: -1911.958745 hartree
zpe.sumelectthermal: -1911.942534 hartree
zpe.sumelectthermalent: -1911.941590 hartree
zpe.sumelectthermalfe: -1912.005245 hartree
dipole: -0.1393 3.0620 -1.8722
dipole: 3.5917
quadrupole: -120.0291 -126.5476 -127.8207
quadrupole: 5.8200 -3.6048 4.4553
quadrupole: 4.7701 -1.7485 -3.0215 5.8200 -3.6048 4.4553
hfenergy: -1912.1863596 hartree
pointgroup: C01 [X(C12H13Cl2N1O1S1)]
dipole: -0.2371183 1.3860136 0.1399373 debye
polarizability: 181.0759447|1.4190449|185.4160253|-22.1694321|26.088803|148.8477162 unknown
InChI: InChI=1S/C12H13Cl2NOS/c13-10-1-2-11(14)9(7-10)8-12(17)15-3-5-16-6-4-15/h1-2,7H,3-6,8H2
charge 0 multiplicity 1
30 atoms
Cl 0.781244 2.105634 2.623899
Cl 3.847234 -0.773887 -2.238258
S  -0.8098 -3.165374 0.264178
O  -4.308857 0.690661 -0.654455
N  -1.784858 -0.642531 -0.154295
C  -1.920825 0.825724 0.033472
C  -2.7297 -1.160255 -1.177768
C  -3.386222 1.174874 0.379534
C  -4.171753 -0.770414 -0.805434
C  -0.907296 -1.460867 0.51342
C  0.059695 -0.806265 1.50647
C  1.194955 -0.037283 0.828276
C  1.629507 1.244834 1.241092
C  1.897865 -0.641126 -0.249692
C  2.970241 0.030098 -0.858801
C  2.707873 1.918689 0.633549
C  3.394093 1.305733 -0.436325
H  -1.64009 1.325428 -0.914594
H  -1.252645 1.193121 0.825037
H  -2.609731 -2.255974 -1.231981
H  -2.461108 -0.714741 -2.155528
H  -3.653171 0.736481 1.365782
H  -3.522948 2.268033 0.414363
H  -4.870348 -1.050303 -1.609994
H  -4.468963 -1.277311 0.137047
H  -0.470745 -0.149343 2.218689
H  0.49134 -1.630757 2.097789
H  1.58865 -1.636179 -0.588212
H  3.009882 2.908167 0.987475
H  4.233483 1.810534 -0.921932
