program: Gaussian 09
title: 000229985
version: EM64L-G09RevD.01
frameworkgroup: C1[X(C12H14ClNOS)]
method: RPBEPBE
basis: SDD
operation: Freq
keyword: #p
keyword: freq=noraman
keyword: PBEPBE/SDD
title: #p freq=noraman PBEPBE/SDD
converged: YES YES NO NO
title: Mulliken charges:
elementType: Cl S O N C C C C C C C C C C C C H H H H H H H H H H H H H H
charge: -0.056614 -0.051600 -0.237026 -0.035253 -0.375324 -0.358117 -0.300320 -0.301963 -0.249449 -0.594245 0.508101 -0.435862 -0.354438 -0.205328 -0.206272 -0.117699 0.247815 0.243970 0.234077 0.259951 0.228645 0.194720 0.207568 0.230124 0.285943 0.221217 0.238050 0.265865 0.256285 0.257178
chargesum: 0.00000
title: Mulliken charges with hydrogens summed into heavy atoms:
elementType: Cl S O N C C C C C C C C C C C C
charge: -0.056614 -0.051600 -0.237026 -0.035253 0.116462 0.135911 0.123045 0.135729 -0.249449 -0.087085 0.508101 -0.197812 -0.088573 0.050957 0.050906 -0.117699
polarizability: 1.98172127e+02 -1.95147531e+01 1.61471837e+02 -5.88723002e+00 -1.27450561e+01 1.27749481e+02
1716.lowfreq: -6.2777 -3.2345 -0.0027 -0.0025 0.0011 7.3136 19.6419 34.2039 50.7118
frequency: 19.6104 34.0366 50.6815 56.9368 85.3813 112.5039 176.0512 201.7837 270.8294 281.3616 292.8282 315.0328 352.2876 385.6215 402.0338 410.1769 415.3963 455.5477 475.0800 494.9132 533.9782 588.5987 624.8641 647.6946 685.7723 726.4126 792.6147 794.2286 824.8639 827.7843 834.9197 838.7210 901.2779 938.3348 960.2025 977.9012 999.9368 1009.6384 1022.7374 1044.3584 1069.5946 1072.2556 1094.3398 1107.1784 1113.4741 1159.7562 1184.7769 1188.1735 1197.0925 1205.5955 1250.0137 1259.3545 1274.6814 1290.1164 1304.7679 1327.1329 1342.0885 1349.6644 1370.0252 1373.8716 1396.4177 1440.6336 1443.5207 1448.7086 1455.8900 1463.7206 1474.1035 1486.4859 1585.3583 1599.1685 2950.5270 2965.3945 2988.3801 2989.5329 2996.5046 3063.9652 3064.4603 3084.0954 3093.7737 3120.8048 3122.8787 3133.9444 3167.9053 3170.6276
redmass: 5.4554 5.5434 3.7851 5.6300 5.3494 8.1407 2.9252 8.7684 3.9258 3.5700 4.8602 3.8236 4.4526 3.4505 2.7921 2.8265 2.3340 2.8374 3.7928 3.3035 6.5747 2.2016 6.2274 5.0666 3.5444 3.9082 3.1731 4.0174 1.7675 1.6188 2.6129 1.4043 2.4236 1.6320 1.6873 1.3986 4.3491 2.4435 2.3469 2.1867 3.6867 2.8246 2.2931 1.7502 2.4263 1.5376 1.1252 1.1065 2.8044 1.8303 1.3865 1.5324 1.2233 1.3086 1.4288 1.2527 1.2367 1.3573 1.2616 6.6953 2.7146 1.4228 1.0818 1.0877 1.0952 1.4804 2.2511 1.4214 7.4320 6.1481 1.0681 1.0679 1.0610 1.0650 1.0685 1.1013 1.0952 1.0964 1.0982 1.0905 1.0920 1.0905 1.0948 1.0958
irintensity: 0.7818 0.4690 0.4732 4.0483 0.2457 0.0827 3.3550 2.1125 0.4584 9.6860 5.1221 9.0936 2.4977 2.6711 5.5485 0.1533 1.1405 0.1805 2.4369 33.3616 7.6832 13.8898 0.6564 8.9132 4.3933 8.0807 35.4156 6.7938 7.5417 25.8179 3.4585 19.7636 2.7865 11.5257 13.7024 3.1096 41.9021 6.2454 45.8226 38.5669 40.7512 30.1458 17.0850 5.0934 17.5787 38.6151 1.0517 4.0781 9.6793 13.8574 54.6491 53.3061 17.5941 22.0121 8.1937 2.0737 1.5364 4.8213 0.2748 0.0889 4.4323 106.2270 10.0969 2.2132 3.0501 102.8057 70.0890 58.3397 1.9759 4.5319 49.1955 50.7289 33.5325 19.2463 40.2586 13.4354 7.5111 29.2833 27.4470 17.8606 6.4706 0.4715 5.1426 1.3602
temp: 298.150 k
press: 1.00000 atm
elementType: 17 16 8 7 6 6 6 6 6 6 6 6 6 6 6 6 1 1 1 1 1 1 1 1 1 1 1 1 1 1
symmnumber: 1
zpe: 622678.3 jmol-1
zpe.correction: 0.237166 hartree
zpe.thermalcorrener: 0.252109 hartree
zpe.thermalcorrenthalpy: 0.253054 hartree
zpe.thermalcorrgfe: 0.192340 hartree
zpe.sumelectzpe: -1452.569112 hartree
zpe.sumelectthermal: -1452.554168 hartree
zpe.sumelectthermalent: -1452.553224 hartree
zpe.sumelectthermalfe: -1452.613938 hartree
dipole: -0.9741 -2.8832 1.4686
dipole: 3.3792
quadrupole: -121.1792 -121.7604 -101.3956
quadrupole: 2.2401 1.9940 -6.7040
quadrupole: -6.4008 -6.9820 13.3828 2.2401 1.9940 -6.7040
hfenergy: -1452.8062776 hartree
pointgroup: C01 [X(C12H14Cl1N1O1S1)]
dipole: -0.6705626 1.0128614 -0.5403007 debye
polarizability: 187.9883519|25.0942123|172.4670697|5.41052|-12.3563784|126.9380231 unknown
InChI: InChI=1S/C12H14ClNOS/c13-11-3-1-10(2-4-11)9-12(16)14-5-7-15-8-6-14/h1-4H,5-9H2
charge 0 multiplicity 1
30 atoms
Cl 4.971528 1.873604 0.548667
S  -1.172603 -3.136882 0.122087
O  -4.138208 1.212031 0.672252
N  -1.824884 -0.484951 0.262517
C  -1.781951 0.959335 -0.081889
C  -2.785526 -0.762929 1.361106
C  -3.202365 1.457251 -0.431779
C  -4.179915 -0.22938 0.984842
C  -1.079339 -1.474995 -0.330879
C  -0.092492 -1.063789 -1.428828
C  1.141612 -0.313689 -0.915698
C  1.668657 0.785784 -1.63837
C  1.808176 -0.735473 0.263252
C  2.834856 1.456892 -1.203913
C  2.972222 -0.075647 0.714778
C  3.467975 1.01372 -0.027894
H  -1.092482 1.147049 -0.916432
H  -1.406647 1.516582 0.799147
H  -2.423959 -0.257958 2.278261
H  -2.804442 -1.853431 1.530868
H  -3.202356 2.548946 -0.58528
H  -3.56116 0.95252 -1.355503
H  -4.577184 -0.792897 0.113954
H  -4.875809 -0.326013 1.833457
H  0.226685 -2.003893 -1.909322
H  -0.59668 -0.463981 -2.212096
H  1.174931 1.122334 -2.558699
H  1.416635 -1.591031 0.825469
H  3.23846 2.303469 -1.766757
H  3.485167 -0.405378 1.622983
