program: Gaussian 09
title: 000229983
version: EM64L-G09RevD.01
frameworkgroup: C1[X(C11H10Cl2N2O2)]
method: RPBEPBE
basis: SDD
operation: Freq
keyword: #p
keyword: freq=noraman
keyword: PBEPBE/SDD
title: #p freq=noraman PBEPBE/SDD
converged: YES YES NO NO
title: Mulliken charges:
elementType: Cl Cl O O N N C C C C C C C C C C C H H H H H H H H H H
charge: -0.061848 -0.035310 -0.289034 -0.215516 -0.122806 -0.397018 -0.375270 -0.579283 -0.483444 0.655517 0.255434 0.145193 -0.339293 -0.344577 -0.211295 -0.226715 -0.101611 0.251251 0.243900 0.277719 0.248908 0.258834 0.253106 0.358335 0.287345 0.283677 0.263800
chargesum: 0.00000
title: Mulliken charges with hydrogens summed into heavy atoms:
elementType: Cl Cl O O N N C C C C C C C C C C C
charge: -0.061848 -0.035310 -0.289034 -0.215516 -0.122806 -0.038683 0.119880 -0.052656 0.028496 0.655517 0.255434 0.145193 -0.339293 -0.057232 0.072383 0.037085 -0.101611
polarizability: 1.92193875e+02 7.21032127e+00 1.54660348e+02 -9.97609433e+00 9.79763658e+00 1.13224407e+02
1716.lowfreq: -8.4041 -1.8164 0.0017 0.0023 0.0033 7.6372 14.4997 26.6498 44.3473
frequency: 14.0860 26.5738 44.3438 73.4389 111.8839 158.7762 163.8446 163.9764 186.1089 193.5142 263.1710 299.0031 345.2879 368.4625 371.3635 405.5346 426.1123 438.0418 460.9524 483.5490 530.1562 561.6664 581.5963 637.4343 671.4670 674.4913 692.0072 730.1475 748.9806 766.5745 808.7974 824.5479 849.2836 865.3612 914.4946 946.9194 978.4648 1011.1595 1021.7401 1051.7625 1082.3708 1112.5044 1143.9133 1159.7836 1195.6132 1205.1205 1231.5790 1265.7531 1283.8516 1305.3773 1321.9838 1349.2516 1358.0923 1369.0109 1369.9031 1378.0804 1433.3978 1441.9894 1452.9451 1469.6142 1490.8692 1566.3563 1593.8727 1634.3772 1652.9542 2964.7972 3006.0234 3028.6474 3069.6377 3089.9715 3099.6467 3142.2658 3178.1208 3184.6266 3525.0629
redmass: 5.7470 10.5038 7.4102 7.0328 5.9083 5.8184 7.7791 6.1315 7.2214 4.1008 4.1908 7.5959 3.6343 9.4600 8.0292 6.1690 3.6346 3.0331 3.1169 5.6445 4.1956 4.2319 3.3613 6.2331 2.7922 5.0706 5.4363 5.2561 2.2794 2.4326 2.5408 3.5753 1.6149 1.4000 2.2545 2.2638 1.3582 2.0197 3.9157 2.0635 2.4923 3.2270 1.6850 1.7088 1.4161 2.6582 1.9295 1.5402 1.6968 2.0009 1.3707 2.0456 1.5983 1.8711 2.1971 4.3854 1.9712 1.1092 1.8134 1.3969 1.1408 7.5947 7.2178 8.2414 5.6407 1.0693 1.0653 1.0592 1.0951 1.1044 1.0966 1.0914 1.0955 1.0937 1.0768
irintensity: 3.2053 0.6736 4.2837 0.7763 1.2865 2.5104 2.4405 0.4263 1.8250 0.5510 5.0226 0.8906 1.5526 30.6575 8.3179 28.6132 2.2719 4.8725 2.4882 10.8564 5.0153 29.5115 5.1556 5.7754 19.0247 6.7988 3.1817 29.2356 52.4212 57.0745 15.1523 57.2643 32.2080 18.8844 3.1626 4.1853 2.7503 4.9471 46.3468 5.3463 30.2348 3.4533 20.6013 1.5585 88.6383 9.4236 175.8428 25.6069 130.4878 15.5701 23.7157 93.3757 1.5549 33.3097 8.1632 12.2943 136.0771 17.3419 77.9937 85.4567 37.5134 26.5333 50.4710 264.0161 432.9144 43.9969 7.3520 17.1528 7.5184 5.0552 8.0587 0.4018 0.8406 0.8327 56.6695
temp: 298.150 k
press: 1.00000 atm
elementType: 17 17 8 8 7 7 6 6 6 6 6 6 6 6 6 6 6 1 1 1 1 1 1 1 1 1 1
symmnumber: 1
zpe: 514528.5 jmol-1
zpe.correction: 0.195974 hartree
zpe.thermalcorrener: 0.211384 hartree
zpe.thermalcorrenthalpy: 0.212328 hartree
zpe.thermalcorrgfe: 0.150197 hartree
zpe.sumelectzpe: -1604.048475 hartree
zpe.sumelectthermal: -1604.033064 hartree
zpe.sumelectthermalent: -1604.032120 hartree
zpe.sumelectthermalfe: -1604.094251 hartree
dipole: -1.3830 2.2849 -0.1862
dipole: 2.6773
quadrupole: -133.4513 -110.5015 -119.1394
quadrupole: 7.8335 -5.7150 0.4610
quadrupole: -12.4205 10.5293 1.8913 7.8335 -5.7150 0.4610
hfenergy: -1604.2444485 hartree
pointgroup: C01 [X(C11H10Cl2N2O2)]
dipole: 0.6259686 -0.575872 0.6213506 debye
polarizability: 189.9910818|16.6115358|122.1550434|-0.388608|-18.9526371|147.9325053 unknown
InChI: InChI=1S/C11H10Cl2N2O2/c12-8-2-1-7(9(13)5-8)6-15-4-3-10(16)14-11(15)17/h1-2,5,14H,3-4,6H2
charge 0 multiplicity 1
27 atoms
Cl 1.987836 -1.705576 2.168988
Cl 4.971816 2.089407 -0.540658
O  -1.894445 -0.502786 -2.197651
O  -4.622256 1.58696 0.936936
N  -1.284762 -0.710488 0.05952
N  -3.294401 0.39241 -0.553418
C  -1.678856 -0.572357 1.481354
C  -0.066119 -1.479091 -0.288507
C  -2.434161 0.747598 1.717514
C  1.190691 -0.615703 -0.314403
C  -2.116887 -0.298565 -0.96621
C  -3.561429 0.950002 0.708565
C  2.173447 -0.616655 0.701836
C  1.410323 0.253232 -1.418444
C  3.327302 0.191466 0.658642
C  2.548261 1.081075 -1.501331
C  3.492098 1.03481 -0.455916
H  -0.764001 -0.598176 2.096761
H  -2.309709 -1.435141 1.781361
H  -0.234235 -1.909493 -1.290351
H  0.040891 -2.302547 0.437698
H  -1.740913 1.606147 1.625205
H  -2.868441 0.777803 2.729613
H  -3.963028 0.585617 -1.306003
H  0.662927 0.267924 -2.219963
H  4.067864 0.162334 1.461243
H  2.701088 1.740692 -2.359577
