program: Gaussian 09
title: 000229982
version: EM64L-G09RevD.01
frameworkgroup: C1[X(C7H8N4O2S)]
method: RPBEPBE
basis: SDD
operation: Freq
keyword: #p
keyword: freq=noraman
keyword: PBEPBE/SDD
title: #p freq=noraman PBEPBE/SDD
converged: NO YES NO NO
title: Mulliken charges:
elementType: S O O N N N N C C C C C C C H H H H H H H H
charge: 0.227407 -0.223588 -0.246688 -0.169126 -0.399215 0.020521 -0.411436 0.290669 -0.055111 -0.186761 0.133989 -0.619525 0.149198 -0.797296 0.341262 0.268127 0.216079 0.268129 0.365793 0.293402 0.293317 0.240854
chargesum: 0.00000
title: Mulliken charges with hydrogens summed into heavy atoms:
elementType: S O O N N N N C C C C C C C
charge: 0.227407 -0.223588 -0.246688 -0.169126 -0.057953 0.020521 -0.045643 0.290669 -0.055111 -0.186761 0.133989 0.132809 0.149198 0.030277
polarizability: 1.92625770e+02 3.18777883e+00 1.39938447e+02 -2.25714398e-03 -1.18929832e-02 5.78083258e+01
1716.lowfreq: -109.3685 -5.0653 -0.0023 -0.0020 -0.0012 3.5058 5.9568 47.2078 77.2463
frequency: -109.3677 47.1989 77.2427 99.4794 113.5000 123.1872 165.7446 171.4206 221.3506 240.7741 269.6060 311.9899 340.9267 384.7539 423.4768 504.9077 516.6374 530.0644 600.9142 617.9503 648.5724 654.1900 672.2010 692.2579 735.4978 737.5599 768.7819 834.3590 959.1193 988.8859 1003.5827 1025.5322 1087.9230 1111.5752 1120.0323 1218.5496 1265.5350 1278.6350 1339.5833 1347.3400 1362.4786 1390.0674 1415.3378 1433.1667 1448.5992 1453.3040 1461.7992 1485.7818 1534.2140 1581.5451 1667.5167 1677.8151 2997.4975 3030.6934 3088.5440 3107.9288 3160.2035 3164.6703 3528.9347 3566.3509
redmass: 1.0226 3.9427 3.7679 1.6710 2.1967 4.3994 5.7834 8.5408 3.6170 4.1033 6.1687 13.4978 11.6488 10.9435 7.4997 10.1686 7.7324 1.1777 6.4519 4.2059 8.2760 7.2718 5.3537 3.3906 6.5315 3.2774 3.1482 7.7789 3.5207 1.1733 1.2724 4.4393 2.9582 4.9456 1.3131 3.2507 9.1543 5.7238 2.4641 1.1892 1.8152 3.3609 5.7558 1.0513 1.2310 1.0825 1.0373 1.0960 4.8756 8.3821 6.9788 6.6321 1.0338 1.0276 1.1030 1.1007 1.1052 1.1063 1.0769 1.0782
irintensity: 0.0215 3.8163 4.1472 1.4280 0.2051 5.5622 0.8143 3.2247 0.7490 0.5601 0.5017 1.9964 0.9031 22.8480 1.1302 11.7196 14.1352 95.5218 5.7567 1.9132 0.4405 1.9938 13.6727 2.8465 17.0430 57.5201 104.9691 4.8997 4.2464 6.5963 6.7908 48.2484 73.5384 51.1370 1.1006 20.6049 87.1726 25.0489 18.9899 15.6717 30.3858 59.6782 48.7503 14.7474 11.3303 38.8053 17.8991 19.8807 131.9189 28.1390 702.3308 597.2047 28.8428 17.0348 10.4545 15.6499 5.5001 6.3195 68.6689 55.5919
temp: 298.150 k
press: 1.00000 atm
elementType: 16 8 8 7 7 7 7 6 6 6 6 6 6 6 1 1 1 1 1 1 1 1
symmnumber: 1
zpe: 411559.0 jmol-1
zpe.correction: 0.156755 hartree
zpe.thermalcorrener: 0.169598 hartree
zpe.thermalcorrenthalpy: 0.170543 hartree
zpe.thermalcorrgfe: 0.116684 hartree
zpe.sumelectzpe: -1038.067508 hartree
zpe.sumelectthermal: -1038.054664 hartree
zpe.sumelectthermalent: -1038.053720 hartree
zpe.sumelectthermalfe: -1038.107579 hartree
dipole: 4.3932 -5.6502 -0.0041
dipole: 7.1572
quadrupole: -95.0364 -89.1950 -89.1201
quadrupole: 0.1262 0.0023 -0.0018
quadrupole: -3.9192 1.9221 1.9971 0.1262 0.0023 -0.0018
hfenergy: -1038.2242623 hartree
pointgroup: C01 [X(C7H8N4O2S1)]
dipole: -1.6541952 -2.2787315 0.0026952 debye
dipolederiv: -0.6514572 0.1004465 -0.0000158 -0.001547 -0.0780681 0.0000693 -0.000448 0.0001532 -0.0744074 -0.5391208 -0.1089656 0.000065 -0.2067374 -1.3364629 0.0003075 0.0002074 0.0014078 -0.3442902 -1.5400036 0.3308381 -0.0006753 0.4443936 -0.6492944 0.0003509 0.001753 -0.0005883 -0.3866202 -0.7280013 -0.187248 -0.0002234 -0.0695862 -0.6208203 -0.0001381 0.0000608 0.0009592 -0.0877762 -1.3641583 0.2270715 0.0000805 -0.2920927 -0.5040469 0.0004279 -0.0000351 0.0003514 -0.2950085 -0.5839859 0.038649 -0.000217 -0.3828856 -0.4679131 0.0000415 0.0001181 0.0001817 -0.186484 -0.8239648 0.402522 -0.0004727 0.5261364 -0.9893721 0.0000867 -0.0003849 0.0003514 -0.3651456 0.8382545 -0.0261228 0.0001337 0.0572353 0.7215196 -0.0001307 -0.000049 -0.0007468 0.1124672 -0.1805751 -0.3836956 0.0004988 -0.3455325 -0.6418638 0.0001913 0.0001791 0.0000917 -0.0545998 1.2141028 -0.17691 0.0003653 0.1430936 0.3181777 -0.0001766 0.0002829 -0.0002237 -0.0377509 1.3889816 0.0777448 0.0002001 0.2235982 1.8155618 -0.0006854 -0.0001677 -0.0012634 0.265075 0.1227139 0.126833 0.0004349 0.1095963 0.461066 0.0006334 0.0002716 0.0005176 0.2067774 2.2183773 -0.278785 0.0003713 -0.1266741 1.250489 -0.0005517 -0.0015274 0.0001077 0.3089553 0.1113184 -0.1268656 -0.0000323 -0.1962651 0.1930407 0.0001063 0.0001579 0.0000731 0.0539802 0.1691832 -0.0119261 -0.0000557 -0.014045 0.2112992 0.0000113 -0.0001869 -0.0000713 0.3415641 0.0607672 -0.0891767 -0.0836331 -0.0386694 0.0334809 0.0070894 -0.0827745 -0.045847 -0.0218307 -0.0810969 0.1521061 -0.0014512 0.0418661 0.0193755 0.0002437 -0.0009556 0.0003873 0.1240991 0.0592534 -0.0897265 0.0846581 -0.0381737 0.0351937 -0.0079073 0.0833528 0.0441031 -0.0198633 0.2031527 0.0553514 -0.0000058 0.0495222 0.1803155 0.0001512 0.000083 0.0001904 0.340351 0.1110089 -0.0263805 0.0617178 0.0549433 -0.0137457 0.0610822 0.0462142 0.040406 -0.0052699 0.1109574 -0.026309 -0.0616371 0.0551055 -0.0137995 -0.0611608 -0.0460856 -0.0405096 -0.0055079 -0.1157074 0.0205488 -0.000106 0.0067183 0.0758671 -0.0000422 -0.0000661 -0.0000315 0.1312854 unknown
polarizability: 192.7785854|-1.444683|139.7856202|0.0098457|-0.0322177|57.8083374 unknown
InChI: InChI=1S/C7H8N4O2S/c1-11-4-3(8-7(11)14-2)5(12)10-6(13)9-4/h9-10H,1-2H3
charge 0 multiplicity 1
22 atoms
S  -3.658325 -0.53098 -0.000663
O  1.237389 2.87892 -0.002078
O  3.869034 -1.011712 -0.000191
N  -0.955856 -1.280252 0.000692
N  1.544311 -1.283749 0.001169
N  -1.28828 0.990853 -0.001121
N  2.478201 0.889823 -0.000099
C  0.298682 -0.681023 0.000637
C  0.091587 0.709529 -0.000141
C  -1.883582 -0.204424 -0.000253
C  1.224662 1.621247 -0.000209
C  -1.291105 -2.709821 0.001345
C  2.720562 -0.491676 0.001327
C  -4.239226 1.261424 -0.000534
H  1.695478 -2.293342 0.001107
H  -1.873103 -2.969455 -0.899791
H  -0.37153 -3.317325 0.007688
H  -1.882662 -2.965805 0.897265
H  3.319165 1.475952 -0.001276
H  -3.858825 1.764144 -0.89982
H  -3.859662 1.763804 0.899299
H  -5.338511 1.213169 -0.001054
