program: Gaussian 09
title: 000229979
version: EM64L-G09RevD.01
frameworkgroup: C1[X(C12H10BrN5)]
method: RPBEPBE
basis: SDD
operation: Freq
keyword: #p
keyword: freq=noraman
keyword: PBEPBE/SDD
title: #p freq=noraman PBEPBE/SDD
converged: YES YES NO NO
title: Mulliken charges:
elementType: Br N N N N N C C C C C C C C C C C C H H H H H H H H H H
charge: 0.006071 -0.166292 -0.466485 -0.021081 -0.098717 0.041495 0.103996 0.204448 -0.104605 -0.231417 0.467050 -0.646929 -0.453808 -0.306869 -0.379063 -0.153086 -0.170737 -0.240579 0.319514 0.263835 0.247897 0.246021 0.246259 0.218118 0.328409 0.247906 0.249390 0.249258
chargesum: 0.00000
title: Mulliken charges with hydrogens summed into heavy atoms:
elementType: Br N N N N N C C C C C C C C C C C C
charge: 0.006071 -0.166292 -0.146970 -0.021081 -0.098717 0.041495 0.103996 0.204448 -0.104605 0.032418 0.467050 0.093247 -0.235690 0.021540 -0.131157 0.096304 0.078521 -0.240579
polarizability: 3.40752196e+02 1.20103126e+00 1.84822896e+02 5.82991695e-02 -1.16523214e-01 7.06041259e+01
1716.lowfreq: -5.7531 -0.0002 0.0003 0.0005 2.5886 4.4438 27.6072 40.1666 71.2091
frequency: 27.4997 40.0626 71.2087 80.3753 121.2706 145.1825 181.9760 196.3813 216.7507 223.8330 265.7189 302.8593 323.0673 323.8272 353.7684 410.7558 500.4330 512.0292 538.6504 553.6039 571.2260 576.4214 598.8233 624.4996 638.5918 665.6058 706.1518 724.5682 764.0687 787.4961 808.0022 809.1874 826.4519 851.1748 852.7469 928.7966 937.5189 988.5521 995.7511 1018.5410 1030.7963 1058.0974 1063.7610 1111.9665 1118.4067 1184.1511 1194.6868 1220.7014 1249.5721 1271.3759 1289.4737 1295.6886 1316.2409 1344.3043 1367.7900 1370.2656 1398.8432 1417.1141 1429.0364 1455.2113 1474.9289 1480.4080 1492.3072 1499.3673 1517.4729 1575.4399 1602.1841 1606.0770 2978.0881 3062.2317 3102.1491 3108.3331 3163.9419 3165.6218 3172.3066 3192.0026 3221.9403 3557.7502
redmass: 6.8362 4.3185 7.3834 4.9599 4.7416 7.8122 1.5912 9.3671 2.7254 3.5062 3.9895 5.5253 4.2399 4.5746 7.7062 3.0152 2.3044 4.7338 10.0531 2.0071 6.8450 2.0966 4.1382 7.1840 7.4091 8.0434 3.3858 7.1982 7.8762 5.2950 5.9838 1.4562 1.6576 1.3776 7.9393 1.4309 1.3589 5.0523 1.3090 2.6821 5.7275 2.8647 2.4494 1.3781 1.3084 1.1456 2.6174 2.2007 2.7508 4.8426 2.0022 2.3981 3.2699 2.2576 5.3868 4.3824 3.9679 2.7417 2.2566 1.5696 2.4046 1.0423 1.0766 2.5799 6.8413 8.8167 5.2468 3.4461 1.0355 1.1034 1.0979 1.0903 1.0911 1.0921 1.0946 1.0955 1.0985 1.0752
irintensity: 0.1181 1.9477 3.2971 1.4821 0.0002 0.1064 0.3558 0.0040 0.0011 0.0394 0.8178 0.5853 7.2064 0.5662 10.1769 0.0021 60.4346 6.4797 0.3953 22.7339 10.9585 9.8793 18.3302 1.3667 3.0509 0.8125 0.2820 8.4723 6.1435 0.6527 18.5141 43.6381 19.6714 50.5780 10.5917 12.9775 0.3059 42.4302 3.2606 11.3435 19.0576 39.8346 3.5205 17.1348 0.3866 8.0876 6.7222 65.5628 27.0403 0.0083 51.7874 55.3704 8.8188 1.1502 40.1838 73.4606 25.8180 33.9341 21.7097 53.5210 255.5477 18.2112 52.4006 116.8603 360.9869 311.9114 153.0370 223.6058 36.4351 18.3257 13.7967 18.8511 2.3346 18.7571 3.7573 23.3231 1.2785 17.6988
temp: 298.150 k
press: 1.00000 atm
elementType: 35 7 7 7 7 7 6 6 6 6 6 6 6 6 6 6 6 6 1 1 1 1 1 1 1 1 1 1
symmnumber: 1
zpe: 539656.1 jmol-1
zpe.correction: 0.205544 hartree
zpe.thermalcorrener: 0.220590 hartree
zpe.thermalcorrenthalpy: 0.221534 hartree
zpe.thermalcorrgfe: 0.161180 hartree
zpe.sumelectzpe: -749.234215 hartree
zpe.sumelectthermal: -749.219170 hartree
zpe.sumelectthermalent: -749.218226 hartree
zpe.sumelectthermalfe: -749.278580 hartree
dipole: 0.2557 7.5237 0.0099
dipole: 7.5280
quadrupole: -146.4377 -98.0589 -118.0847
quadrupole: -30.1027 -0.0702 -0.0330
quadrupole: -25.5773 22.8016 2.7757 -30.1027 -0.0702 -0.0330
hfenergy: -749.4397596 hartree
pointgroup: C01 [X(C12H10Br1N5)]
dipole: 0.1834859 2.9523637 -0.1479229 debye
polarizability: 340.6519575|-3.3391483|184.5783638|-3.330307|-5.8424066|70.9488968 unknown
InChI: InChI=1S/C12H10BrN5/c1-18-7-16-11-10(18)12(15-6-14-11)17-9-4-2-8(13)3-5-9/h2-7,17H,1H3
charge 0 multiplicity 1
28 atoms
Br 6.430223 -0.227437 -0.018771
N  -2.793896 1.470072 0.018208
N  0.277887 0.602908 0.017387
N  -4.474882 -0.09893 0.114683
N  -0.617217 -1.614162 0.14593
N  -3.021247 -2.102171 0.198303
C  -2.160356 0.214397 0.072853
C  -0.812007 -0.265209 0.079384
C  -3.226727 -0.748053 0.132682
C  -4.172118 1.204398 0.046595
C  1.67395 0.335824 0.014281
C  -2.190761 2.805955 -0.052372
C  2.538266 1.464568 -0.057365
C  2.239551 -0.966229 0.076851
C  -1.711206 -2.445279 0.201103
C  3.937503 1.306397 -0.067361
C  3.641868 -1.123897 0.067023
C  4.480113 0.006039 -0.004832
H  0.047408 1.595431 -0.035282
H  -4.903551 2.010681 0.015543
H  -2.995916 3.558141 -0.065287
H  -1.559235 3.009972 0.831913
H  -1.599314 2.933581 -0.97778
H  2.120353 2.478778 -0.106141
H  1.573929 -1.828385 0.132491
H  -1.483973 -3.513996 0.253565
H  4.590132 2.182047 -0.122631
H  4.070423 -2.129042 0.115228
