program: Gaussian 09
title: 000229976
version: EM64L-G09RevD.01
frameworkgroup: C1[X(C20H22N4O2S)]
method: RPBEPBE
basis: SDD
operation: Freq
keyword: #p
keyword: freq=noraman
keyword: PBEPBE/SDD
title: #p freq=noraman PBEPBE/SDD
converged: YES YES NO NO
title: Mulliken charges:
elementType: S O O N N N N C C C C C C C C C C C C C C C C C C C C H H H H H H H H H H H H H H H H H H H H H H
charge: 0.188636 -0.301138 -0.217946 -0.347604 -0.390129 0.039420 0.033815 -0.540525 -0.513563 -0.693999 -0.653920 0.334008 0.283340 0.434514 0.446427 -0.366135 -0.389811 -0.378518 -0.381636 -0.335692 -0.369502 -0.223230 -0.248330 -0.209475 -0.219954 -0.235716 -0.237720 0.302842 0.287069 0.236023 0.262008 0.213939 0.221742 0.225521 0.257175 0.303926 0.356259 0.205084 0.226732 0.224187 0.227782 0.270923 0.282717 0.231182 0.227670 0.242037 0.228222 0.233111 0.228233
chargesum: 0.00000
title: Mulliken charges with hydrogens summed into heavy atoms:
elementType: S O O N N N N C C C C C C C C C C C C C C C C C C C C
charge: 0.188636 -0.301138 -0.217946 -0.043678 -0.033871 0.039420 0.033815 -0.237683 -0.226494 0.017972 0.050517 0.334008 0.283340 0.434514 0.446427 -0.161051 -0.163079 -0.154331 -0.153853 -0.064769 -0.086785 0.007951 -0.020660 0.032562 0.008267 -0.002604 -0.009487
polarizability: 4.78786545e+02 -6.17003179e-01 2.82316110e+02 2.26947162e+00 2.38377786e+00 1.80035117e+02
1716.lowfreq: -7.3349 -1.8388 -0.0021 -0.0014 -0.0013 2.0505 13.0159 21.3297 27.5765
frequency: 12.5363 21.2300 27.5418 29.5849 45.9393 48.9897 59.9035 65.0261 76.4933 87.9476 125.4511 131.6258 155.3531 157.1931 160.2525 194.0183 209.8573 219.9653 233.9067 238.1320 250.2089 255.6086 257.6196 275.3996 292.9663 315.3921 332.4075 343.5652 359.7828 403.0463 405.3251 419.4156 441.2468 476.3397 492.6003 509.8394 516.3034 557.6052 579.4845 613.6323 614.6705 618.6456 624.5015 641.7951 660.2135 674.6969 696.5841 700.2541 712.4815 728.7069 771.1092 772.4656 822.9315 834.6078 842.2950 853.9126 858.6799 921.9836 922.5696 925.5728 929.8254 955.7998 963.0060 984.1323 984.6533 985.2429 987.3060 988.9625 994.9144 1005.3379 1005.6660 1021.0237 1022.3202 1024.6768 1034.3837 1067.2324 1080.7152 1082.0407 1090.4731 1094.1507 1119.9857 1167.7762 1171.6379 1174.2909 1182.0991 1184.9205 1188.5599 1222.0504 1238.2072 1246.9672 1255.3921 1297.9808 1309.8875 1316.6173 1317.6283 1345.4531 1351.9202 1389.2561 1391.0500 1392.6910 1395.7732 1436.8002 1438.3273 1455.6014 1465.0278 1471.1582 1480.6839 1481.6288 1487.0474 1517.4807 1545.2378 1567.0928 1567.9013 1588.6890 1593.2119 1596.4606 1611.8439 1612.3543 1642.4844 2962.1819 2978.1503 2993.2716 2993.6442 3043.0280 3058.8044 3077.2973 3088.6994 3098.3441 3108.4872 3114.9808 3117.1292 3126.9117 3133.9219 3138.7796 3147.5616 3155.1383 3162.3920 3167.4610 3174.4992 3193.9483 3395.3885
redmass: 5.9522 5.1112 5.9669 3.9649 5.7457 4.3576 5.2275 4.6523 6.1375 5.3982 5.0827 4.6220 5.7500 5.6456 5.0531 4.1139 2.6846 2.0026 2.0418 2.7546 3.2592 1.9488 2.1321 3.7651 4.2431 4.4183 4.7524 5.4702 4.8885 2.8111 2.8599 5.7926 6.1977 5.7657 5.9249 2.9047 3.1378 5.5405 4.8261 6.4125 6.4533 1.4730 3.5206 5.9966 4.8431 3.9493 1.7579 1.8074 6.0042 5.6190 1.7082 1.7449 1.8603 4.8536 1.8567 1.2569 1.2490 1.3779 2.7160 1.4983 3.3216 1.5906 1.5714 1.4561 1.4963 1.8562 3.4759 3.8539 2.0217 1.3407 1.3611 2.2399 2.1730 2.0300 3.8075 1.5606 1.7762 1.7132 2.7811 2.1864 3.1453 1.9573 1.0967 1.0625 1.1194 1.1160 1.5195 1.3462 1.8300 2.0092 1.9565 1.4203 1.6874 1.5003 1.5051 1.5384 1.6196 5.4613 6.5114 1.2025 1.2004 2.3466 2.3204 1.0422 1.0459 1.0489 1.9035 2.3525 1.2233 1.7838 2.3619 3.4349 5.4496 6.2949 4.7442 5.5355 5.7869 6.0853 4.9342 1.0870 1.0378 1.0368 1.0877 1.0861 1.0929 1.0925 1.0974 1.0979 1.0873 1.1011 1.0880 1.0869 1.0874 1.0923 1.0924 1.0960 1.0970 1.0997 1.0982 1.0826 1.0753
irintensity: 1.5850 0.8449 0.8034 0.1989 1.8217 0.1793 1.7471 4.9969 2.2475 0.3787 4.3041 2.9690 0.2829 16.6310 7.2296 9.4972 6.3236 2.2538 6.5351 2.2165 1.7854 11.1992 8.5536 1.0504 13.4817 7.6370 3.8240 6.6882 14.1326 0.0810 0.0670 1.9862 0.9722 4.9772 10.6888 5.4158 9.4594 10.7062 1.9290 0.6531 0.0888 60.7991 11.1673 9.5987 14.2969 5.0320 47.5910 48.8722 17.3585 5.4987 58.3753 48.1272 75.6080 4.6530 81.3344 0.4806 0.4124 3.4174 14.5176 15.1979 34.4501 30.3225 61.7987 2.0730 5.2599 24.4412 8.4266 0.0743 3.5078 1.7419 2.1028 14.9957 14.8328 7.4185 11.5600 34.9315 65.9910 7.0175 0.2713 59.1754 20.0805 217.6751 23.9561 2.5197 3.5443 5.2583 15.3350 36.4344 10.6721 44.9203 117.8885 10.0712 39.7850 3.7883 11.5566 17.8109 4.9034 0.1360 4.9653 35.5442 22.7303 7.6231 14.5386 12.2750 20.0737 18.8628 56.8459 19.5062 21.7233 160.0764 181.7518 47.0576 56.6122 289.8489 7.9923 15.3473 0.5278 14.3631 234.1126 50.8207 22.9278 27.6090 30.7830 3.9577 5.0500 24.8236 19.2667 19.6650 10.7162 12.0098 7.8784 0.7029 2.0041 29.7508 19.2189 23.2461 29.9724 20.7866 8.5130 219.7775 6.7845
temp: 298.150 k
press: 1.00000 atm
elementType: 16 8 8 7 7 7 7 6 6 6 6 6 6 6 6 6 6 6 6 6 6 6 6 6 6 6 6 1 1 1 1 1 1 1 1 1 1 1 1 1 1 1 1 1 1 1 1 1 1
symmnumber: 1
zpe: 1008143.7 jmol-1
zpe.correction: 0.383982 hartree
zpe.thermalcorrener: 0.410545 hartree
zpe.thermalcorrenthalpy: 0.411489 hartree
zpe.thermalcorrgfe: 0.323820 hartree
zpe.sumelectzpe: -1540.848672 hartree
zpe.sumelectthermal: -1540.822108 hartree
zpe.sumelectthermalent: -1540.821164 hartree
zpe.sumelectthermalfe: -1540.908833 hartree
dipole: 0.9796 7.6209 1.7452
dipole: 7.8793
quadrupole: -136.4729 -153.3270 -174.5371
quadrupole: -14.0023 -10.9137 -11.0685
quadrupole: 18.3061 1.4520 -19.7581 -14.0023 -10.9137 -11.0685
hfenergy: -1541.2326533 hartree
pointgroup: C01 [X(C20H22N4O2S1)]
dipole: -0.5696089 2.8026569 -1.1959906 debye
polarizability: 476.504422|3.9590029|277.8996636|-24.9512776|-21.7183705|186.7336863 unknown
InChI: InChI=1S/C20H22N4O2S/c1-15(19(25)23-21-13-17-9-5-3-6-10-17)27-16(2)20(26)24-22-14-18-11-7-4-8-12-18/h3-16,23-24H,1-2H3
charge 0 multiplicity 1
49 atoms
S  4.4085 0.710314 0.189503
O  1.963831 0.258168 -2.176743
O  3.310013 -2.375274 1.567925
N  1.502308 2.259686 -1.053859
N  1.919356 -1.756358 -0.234216
N  0.139835 1.99665 -0.945421
N  0.760242 -2.274469 0.319857
C  3.856723 1.597329 -1.428244
C  4.291787 -1.155766 -0.33032
C  4.312685 3.063267 -1.327797
C  5.632502 -1.839206 -0.035575
C  2.36381 1.32453 -1.609571
C  3.136894 -1.824772 0.448677
C  -2.038131 2.779882 -0.204311
C  -1.63595 -2.596193 0.103862
C  -0.601916 2.96164 -0.439894
C  -0.345621 -2.08547 -0.375801
C  -2.819296 3.897312 0.201766
C  -2.797978 -2.402235 -0.694566
C  -2.66482 1.508909 -0.348729
C  -1.75958 -3.276625 1.350016
C  -4.200995 3.751919 0.446616
C  -4.054673 -2.878502 -0.262265
C  -4.04132 1.366123 -0.094526
C  -3.015253 -3.747083 1.778396
C  -4.815643 2.486468 0.299688
C  -4.168651 -3.55149 0.976569
H  4.37447 1.08798 -2.256919
H  4.073571 -1.125432 -1.412245
H  3.96104 3.643717 -2.200767
H  5.414338 3.107385 -1.306694
H  3.957349 3.558037 -0.403435
H  6.459459 -1.320494 -0.5486
H  5.598928 -2.890409 -0.377744
H  5.824994 -1.853454 1.049888
H  1.901678 3.113354 -0.636344
H  1.873097 -1.199316 -1.114144
H  -0.175613 3.947898 -0.159337
H  -0.349974 -1.537406 -1.338695
H  -2.342593 4.878506 0.322779
H  -2.709114 -1.88784 -1.660773
H  -2.05373 0.648813 -0.637742
H  -0.8597 -3.419926 1.956762
H  -4.795463 4.618293 0.75621
H  -4.940308 -2.733433 -0.891646
H  -4.507714 0.379132 -0.18634
H  -3.101599 -4.269254 2.737991
H  -5.886495 2.370345 0.500038
H  -5.142877 -3.92285 1.313921
