program: Gaussian 09
title: 000229973
version: EM64L-G09RevD.01
frameworkgroup: C1[X(C6H14N4O2S)]
method: RPBEPBE
basis: SDD
operation: Freq
keyword: #p
keyword: freq=noraman
keyword: PBEPBE/SDD
title: #p freq=noraman PBEPBE/SDD
converged: YES YES NO NO
title: Mulliken charges:
elementType: S O O N N N N C C C C C C H H H H H H H H H H H H H H
charge: 0.101854 -0.260045 -0.259792 -0.365952 -0.366249 -0.502316 -0.502246 -0.465784 -0.467353 -0.630891 -0.630459 0.229333 0.229573 0.285729 0.286076 0.236137 0.257192 0.212383 0.212258 0.236305 0.257070 0.341430 0.341423 0.305672 0.306463 0.305759 0.306432
chargesum: 0.00000
title: Mulliken charges with hydrogens summed into heavy atoms:
elementType: S O O N N N N C C C C C C
charge: 0.101854 -0.260045 -0.259792 -0.024521 -0.024827 0.109820 0.109944 -0.180055 -0.181277 0.074821 0.075173 0.229333 0.229573
polarizability: 1.64053545e+02 -5.35801820e+00 1.07274651e+02 -4.15769537e-02 -2.49980395e-02 9.81005063e+01
1716.lowfreq: -16.1109 -11.0965 -0.0023 -0.0019 0.0011 5.4356 14.8761 22.3512 36.1141
frequency: 13.0881 21.8378 36.0958 47.5446 91.0887 112.1615 117.3397 145.4508 166.9415 181.3699 198.8886 218.0287 219.8297 259.1196 290.0375 291.5625 308.1423 325.4146 375.4196 402.2342 412.6883 514.1429 549.2175 650.2636 664.2837 671.1084 679.3177 728.0685 739.8425 771.6556 773.1066 900.5914 902.3551 981.9977 992.9697 1057.6357 1064.2040 1068.7079 1080.5224 1150.0952 1151.2798 1192.1582 1221.9748 1252.0250 1254.8068 1268.9502 1279.0184 1285.2708 1287.7883 1389.8405 1390.1954 1444.1229 1453.6090 1457.1796 1459.3767 1468.9277 1469.3810 1604.0245 1604.8360 1676.3050 1677.0066 2995.6933 2996.1405 3008.3032 3010.5361 3094.5908 3094.9175 3105.2397 3105.4546 3389.4421 3389.5383 3500.6741 3501.0978 3506.8326 3506.8640
redmass: 6.2304 4.2386 7.6638 5.2608 4.0635 1.5360 1.4301 4.4507 1.8627 1.7512 3.1496 1.1514 1.1336 4.3192 3.0614 4.2164 3.9489 5.3100 4.3311 5.1546 8.4197 5.0787 4.9136 1.5023 1.1695 2.4782 3.6925 2.8901 3.2525 1.6305 1.6278 4.5085 4.1379 1.5516 1.6799 2.5575 2.4164 1.7415 1.8513 3.5149 3.3852 1.2274 1.2399 2.1524 2.0418 1.4404 1.3951 1.1707 1.2617 1.1959 1.1939 1.6973 1.6758 1.0481 1.0561 1.0571 1.0607 8.9923 8.6350 1.0627 1.0629 1.0359 1.0353 1.0825 1.0832 1.1002 1.1001 1.1005 1.1003 1.0430 1.0430 1.0807 1.0807 1.0980 1.0980
irintensity: 1.3597 0.2645 4.1490 2.7089 2.0035 12.2502 39.7808 0.2055 11.2431 17.1978 1.5931 2.5645 2.2559 9.8307 1.0550 7.1088 42.0867 3.1576 8.7165 5.7982 7.4007 7.8936 20.3515 88.5424 105.2293 28.7584 7.1136 19.1398 0.4118 164.1875 90.6042 22.4081 13.9299 17.0448 3.4687 5.7819 1.3094 45.4289 2.6745 15.7235 0.0977 22.4517 1.2970 11.0693 10.2860 4.5704 0.0089 1.9073 0.0285 10.4664 38.2005 269.3269 90.8076 4.3512 41.0538 14.1681 29.7968 313.4018 75.5356 34.2447 10.5541 26.6073 9.6109 3.4283 4.1115 13.8565 23.6840 6.8626 21.1905 0.0483 0.0438 76.7152 18.5817 3.5029 4.7400
temp: 298.150 k
press: 1.00000 atm
elementType: 16 8 8 7 7 7 7 6 6 6 6 6 6 1 1 1 1 1 1 1 1 1 1 1 1 1 1
symmnumber: 1
zpe: 566239.0 jmol-1
zpe.correction: 0.215669 hartree
zpe.thermalcorrener: 0.232532 hartree
zpe.thermalcorrenthalpy: 0.233477 hartree
zpe.thermalcorrgfe: 0.168310 hartree
zpe.sumelectzpe: -1003.469423 hartree
zpe.sumelectthermal: -1003.452560 hartree
zpe.sumelectthermalent: -1003.451616 hartree
zpe.sumelectthermalfe: -1003.516782 hartree
dipole: 0.0114 0.0177 0.0887
dipole: 0.0911
quadrupole: -95.6167 -90.0559 -84.7513
quadrupole: 8.5182 0.0187 0.0651
quadrupole: -5.4755 0.0854 5.3900 8.5182 0.0187 0.0651
hfenergy: -1003.6850924 hartree
pointgroup: C01 [X(C6H14N4O2S1)]
dipole: -0.0041718 0.007461 -0.0348225 debye
polarizability: 164.4295725|2.6858346|106.8973637|-0.0751228|0.1029281|98.1017655 unknown
InChI: InChI=1S/C6H14N4O2S/c1-3(5(11)9-7)13-4(2)6(12)10-8/h3-4,9-10H,7-8H2,1-2H3
charge 0 multiplicity 1
27 atoms
S  -0.001401 0.005159 0.399799
O  3.814143 0.771422 -0.734323
O  -3.808407 -0.770449 -0.751997
N  2.860324 -0.895838 0.571936
N  -2.871169 0.873946 0.594559
N  4.099159 -1.386201 1.067858
N  -4.114588 1.338118 1.104001
C  1.374853 0.522749 -0.842616
C  -1.372034 -0.4924 -0.856435
C  1.271531 2.009742 -1.213023
C  -1.253737 -1.967728 -1.266765
C  2.783328 0.16151 -0.317279
C  -2.783768 -0.159893 -0.321024
H  1.19565 -0.109696 -1.734091
H  -1.199298 0.16571 -1.730391
H  1.367775 2.64541 -0.316822
H  2.086864 2.274825 -1.908263
H  0.302261 2.228311 -1.695403
H  -0.280406 -2.164172 -1.750575
H  -1.347844 -2.628367 -0.388599
H  -2.063578 -2.221381 -1.972584
H  2.013357 -1.367605 0.901908
H  -2.029063 1.34683 0.935151
H  4.553896 -0.677517 1.662144
H  4.717954 -1.640354 0.284213
H  -4.562392 0.608305 1.677577
H  -4.736009 1.608967 0.328043
