program: Gaussian 09
title: 000229971
version: EM64L-G09RevD.01
frameworkgroup: C1[X(C22H24N2S)]
method: RPBEPBE
basis: SDD
operation: Freq
keyword: #p
keyword: freq=noraman
keyword: PBEPBE/SDD
title: #p freq=noraman PBEPBE/SDD
converged: YES YES NO NO
title: Mulliken charges:
elementType: S N N C C C C C C C C C C C C C C C C C C C C C C H H H H H H H H H H H H H H H H H H H H H H H H
charge: 0.210302 -0.289168 -0.103193 -0.400325 0.530938 -0.425375 0.488143 -0.634683 -0.347747 -0.350448 0.419840 -0.355942 0.424186 -0.320563 -0.489123 -0.416447 0.464014 -0.454301 -0.415958 -0.429853 -0.610842 -0.617872 -0.244128 -0.252869 -0.812110 0.204356 0.253154 0.238412 0.202562 0.234368 0.188509 0.241474 0.243068 0.236437 0.249534 0.230612 0.252654 0.240797 0.241331 0.187939 0.217120 0.189645 0.221474 0.223627 0.225801 0.226838 0.223129 0.232178 0.228506
chargesum: 0.00000
title: Mulliken charges with hydrogens summed into heavy atoms:
elementType: S N N C C C C C C C C C C C C C C C C C C C C C C
charge: 0.210302 -0.289168 -0.103193 0.057185 0.530938 0.015599 0.488143 -0.634683 0.075130 -0.350448 0.419840 -0.114468 0.424186 -0.077495 -0.252686 -0.166913 0.464014 -0.223689 -0.163304 -0.189056 0.035547 0.016873 -0.018327 -0.026031 -0.128296
polarizability: 3.97714604e+02 -9.75395697e+00 2.56648105e+02 1.42637502e+01 4.92919625e+01 2.03584744e+02
1716.lowfreq: -8.9567 -6.3763 -4.9278 -0.0016 0.0013 0.0014 17.8359 21.1928 35.9859
frequency: 17.2699 21.1007 35.9529 39.6818 56.2660 62.3082 71.4325 103.7974 122.9098 132.2663 146.1331 182.1408 197.5039 213.9252 218.4232 226.3846 240.5111 276.8878 298.6840 309.4586 327.0011 354.3039 360.1839 376.5629 391.6225 405.5940 410.3286 416.3299 428.5193 442.0290 470.3807 506.1214 524.2947 535.1081 539.1270 545.0206 569.0003 577.5940 635.6093 657.4705 672.8082 678.4818 718.8027 742.5726 756.5275 783.2538 785.4305 810.4504 811.2247 814.7404 840.0905 860.2716 876.9057 877.8751 880.7256 914.5691 939.1828 945.6702 957.6298 965.7631 987.6781 990.4513 994.8248 1014.6945 1029.8590 1035.3140 1036.5378 1047.1694 1072.0661 1078.0255 1091.2605 1115.6257 1133.7668 1135.2059 1155.3881 1161.4534 1166.5126 1174.2557 1209.9665 1218.6150 1236.5725 1242.7708 1262.3864 1265.7597 1269.0570 1272.3194 1296.3440 1324.1388 1340.9165 1343.9880 1354.3605 1367.5719 1374.2021 1398.0207 1400.7256 1404.2544 1406.9860 1417.7979 1428.8551 1437.9187 1456.4805 1457.8893 1462.9149 1468.5582 1470.9377 1474.2046 1476.5015 1476.9649 1483.4534 1483.7527 1490.9694 1505.8439 1560.6590 1572.1074 1596.6136 1616.6577 1631.9782 2847.7549 2855.7529 2872.1466 2954.1180 2974.1551 2993.9982 3018.9611 3021.9722 3030.3980 3050.2819 3051.3911 3077.0514 3078.1629 3081.6950 3082.2705 3119.6690 3125.9764 3128.5699 3130.2515 3130.7618 3145.9979 3157.3559 3162.2056 3163.4863
redmass: 4.1989 3.8291 2.8898 5.1220 3.6361 1.2342 2.5613 3.4558 3.8193 4.0277 3.5423 4.9256 2.2698 1.6717 2.2575 1.4577 3.1596 2.9346 3.4086 4.2291 3.4015 4.0193 3.4234 3.1246 2.3594 2.1227 5.7573 4.0044 2.8390 4.4273 3.5847 3.0572 6.4480 3.7712 4.1320 3.7022 4.9372 3.9798 4.6032 4.5858 4.5427 6.0453 3.8703 2.5199 1.3762 4.1236 3.2582 4.7539 1.3888 1.5750 2.8350 2.6124 2.9206 1.6716 1.3420 4.2524 1.3543 1.3409 3.2661 1.4213 1.3318 2.4332 1.4460 2.3694 2.1584 2.2875 1.7359 1.5306 1.8820 1.8821 1.5420 2.7029 1.7248 1.4761 1.5027 1.5073 1.3060 1.1114 1.4090 2.0066 1.8497 2.6548 1.8874 1.9923 1.7359 2.2523 1.3597 2.0119 2.3381 1.4320 1.8706 1.5655 2.0298 1.3037 5.2159 3.4373 3.0691 1.1414 4.1810 1.1536 1.6502 1.3767 1.0510 1.0956 1.0468 1.0549 1.1119 1.0806 1.2831 1.1017 2.0824 3.3367 6.8574 7.1311 6.1457 6.5288 7.1193 1.0572 1.0627 1.0644 1.0687 1.0372 1.0625 1.0734 1.0722 1.0892 1.0988 1.0977 1.0991 1.0940 1.1006 1.0985 1.0864 1.0886 1.0884 1.0915 1.0878 1.0944 1.0947 1.0996 1.0960
irintensity: 0.0331 0.2440 0.9562 1.1432 0.0355 0.4536 0.3887 0.2802 0.2864 0.0376 2.0294 0.5071 0.6587 3.0547 1.5397 0.3426 1.3298 0.2398 4.1954 5.2407 1.7029 1.5280 7.4486 9.1883 0.6139 0.9596 0.7994 5.2671 15.9789 2.4241 1.3013 0.2065 1.7212 7.6191 3.7696 1.8720 6.0193 5.6936 1.2771 6.0119 8.7964 1.3157 2.5537 20.0673 46.3037 20.9412 6.0193 11.6739 18.9301 89.7224 13.2689 15.1429 2.6868 2.8051 6.3665 13.9469 1.9054 0.0700 8.5806 2.2521 0.0473 21.5226 4.0114 17.9133 5.8522 14.6279 9.5096 9.1277 12.4131 5.0554 2.4923 24.6648 2.0650 5.6364 12.2637 20.2512 8.9714 7.4649 73.7321 9.8779 1.7253 56.6818 48.6375 19.7742 10.4138 11.8180 17.5269 131.2367 8.6956 4.5131 13.2114 1.8382 6.1062 6.1927 30.2250 44.2412 11.4772 2.4459 11.1962 4.1632 93.5603 41.5922 14.8957 10.9537 13.3598 15.3332 8.0992 19.0749 47.4236 1.5882 150.8091 35.3064 10.6880 4.2218 32.8078 0.6074 51.7454 83.3565 67.3688 249.8301 54.3610 57.2954 50.1899 27.6364 47.1977 8.1660 42.7026 21.5820 25.9707 8.0686 47.1945 19.6575 2.9131 18.4197 5.8670 9.1309 11.4101 23.9750 15.1122 46.9491 10.1597
temp: 298.150 k
press: 1.00000 atm
elementType: 16 7 7 6 6 6 6 6 6 6 6 6 6 6 6 6 6 6 6 6 6 6 6 6 6 1 1 1 1 1 1 1 1 1 1 1 1 1 1 1 1 1 1 1 1 1 1 1 1
symmnumber: 1
zpe: 1056976.7 jmol-1
zpe.correction: 0.402581 hartree
zpe.thermalcorrener: 0.425985 hartree
zpe.thermalcorrenthalpy: 0.426930 hartree
zpe.thermalcorrgfe: 0.347964 hartree
zpe.sumelectzpe: -1358.503602 hartree
zpe.sumelectthermal: -1358.480198 hartree
zpe.sumelectthermalent: -1358.479254 hartree
zpe.sumelectthermalfe: -1358.558219 hartree
dipole: 1.5129 1.6156 0.8982
dipole: 2.3887
quadrupole: -140.4528 -144.9405 -152.8046
quadrupole: -1.2165 1.3091 6.9045
quadrupole: 5.6131 1.1255 -6.7386 -1.2165 1.3091 6.9045
hfenergy: -1358.9061836 hartree
pointgroup: C01 [X(C22H24N2S1)]
dipole: -0.5100767 -0.7138368 0.3367827 debye
polarizability: 397.9326901|8.8769555|258.5437075|-6.8546191|-49.5532768|201.4710545 unknown
InChI: InChI=1S/C22H24N2S/c1-16-9-11-19-21(15-16)25-22-18-8-5-4-7-17(18)10-12-20(22)24(19)14-6-13-23(2)3/h4-5,7-12,15H,6,13-14H2,1-3H3
charge 0 multiplicity 1
49 atoms
S  -0.160947 1.343228 -1.53793
N  -0.854445 -0.658715 0.644478
N  -0.12067 -4.011484 -0.849078
C  -1.216549 -2.006957 1.145322
C  0.504595 -0.220147 0.683998
C  -2.089027 -2.786758 0.134016
C  -1.892413 0.292672 0.404925
C  0.982079 0.749037 -0.218725
C  -1.289013 -3.143268 -1.139494
C  -1.695146 1.348979 -0.52503
C  2.331168 1.23575 -0.168787
C  1.409359 -0.733584 1.677387
C  3.236826 0.669366 0.814156
C  -3.138162 0.241793 1.083197
C  2.736052 -0.315686 1.724534
C  -2.673629 2.335459 -0.738164
C  -3.923953 2.279208 -0.066732
C  -4.136021 1.210515 0.836811
C  2.838342 2.233652 -1.06841
C  4.598296 1.113052 0.852363
C  0.956386 -3.883496 -1.853016
C  -0.489588 -5.421488 -0.615337
C  4.171448 2.645968 -1.004746
C  5.064514 2.080806 -0.040184
C  -4.986072 3.335785 -0.316081
H  -1.712234 -1.953597 2.137078
H  -0.286311 -2.587476 1.255646
H  -2.980672 -2.198883 -0.153285
H  -2.458763 -3.70466 0.63215
H  -0.913882 -2.202718 -1.584209
H  -1.975075 -3.610405 -1.890501
H  1.043763 -1.454869 2.413405
H  -3.332527 -0.552915 1.809594
H  3.411669 -0.732063 2.480789
H  -2.470223 3.145742 -1.448153
H  -5.091625 1.136929 1.369395
H  2.159365 2.681141 -1.802125
H  5.27203 0.677474 1.600157
H  1.263897 -2.826349 -1.934442
H  0.660551 -4.240804 -2.87206
H  1.835216 -4.471297 -1.530587
H  -0.921191 -5.916765 -1.523002
H  -1.233596 -5.496158 0.196815
H  0.404043 -5.993419 -0.306609
H  4.537814 3.413201 -1.695936
H  6.107565 2.413244 -0.003118
H  -5.915366 3.108503 0.234176
H  -4.642225 4.336825 0.007162
H  -5.24045 3.410931 -1.39001
