program: Gaussian 09
title: 000229969
version: EM64L-G09RevD.01
frameworkgroup: C1[X(C21H21ClN2S)]
method: RPBEPBE
basis: SDD
operation: Freq
keyword: #p
keyword: freq=noraman
keyword: PBEPBE/SDD
title: #p freq=noraman PBEPBE/SDD
converged: YES YES NO NO
title: Mulliken charges:
elementType: Cl S N N C C C C C C C C C C C C C C C C C C C C C H H H H H H H H H H H H H H H H H H H H H
charge: -0.051398 0.223020 -0.295269 -0.085500 -0.415481 0.525674 -0.401203 0.582351 -0.609244 -0.323577 -0.317120 0.432533 -0.359936 0.413253 -0.479087 -0.261493 -0.289093 -0.417347 -0.426020 -0.237931 -0.240945 -0.617831 -0.624145 -0.241940 -0.249828 0.225492 0.231174 0.228596 0.221132 0.196276 0.208967 0.245723 0.239883 0.253672 0.253163 0.242940 0.255749 0.238279 0.223757 0.188576 0.219589 0.227975 0.191628 0.217259 0.228371 0.229351
chargesum: 0.00000
title: Mulliken charges with hydrogens summed into heavy atoms:
elementType: Cl S N N C C C C C C C C C C C C C C C C C C C C C
charge: -0.051398 0.223020 -0.295269 -0.085500 0.041184 0.525674 0.048525 0.582351 -0.609244 0.081666 -0.317120 0.432533 -0.114213 0.413253 -0.239203 -0.261493 -0.035421 -0.164184 -0.183080 0.017818 -0.002666 0.014092 0.012718 -0.013569 -0.020477
polarizability: 3.76777395e+02 2.17053548e+01 1.93556135e+02 -3.53276328e+00 2.72240108e+01 2.63481691e+02
1716.lowfreq: -24.2195 -11.1676 -0.0022 -0.0020 -0.0006 4.9609 9.6911 12.6287 29.4190
frequency: -23.5637 10.8638 29.2151 42.9930 55.0772 68.6586 98.7398 118.0750 130.5060 156.5565 167.2406 185.9701 195.3130 213.9509 219.6260 232.4537 245.7591 266.1503 304.2598 321.9169 335.0258 341.1458 344.0550 377.6314 399.1963 407.7923 414.2143 423.3447 434.8857 471.6830 501.6477 509.0162 523.2650 525.4960 536.0906 552.7121 558.6480 599.5016 644.3124 674.9730 687.6787 703.9589 746.3035 758.4261 768.0273 776.3575 785.0304 792.7346 809.6668 823.5223 829.6460 879.3639 882.5061 892.4197 911.6892 950.9863 953.8488 957.6480 969.6655 990.0324 993.2250 1028.3493 1030.0647 1033.4829 1042.4133 1068.4328 1078.5618 1089.5924 1094.3534 1111.7580 1134.0148 1138.3639 1152.7697 1159.5480 1172.2487 1174.9034 1200.9998 1223.2279 1235.5172 1240.4026 1252.7645 1259.9206 1267.7598 1301.4825 1311.9034 1329.8541 1338.3567 1354.4575 1365.9923 1380.3904 1401.6444 1407.9743 1418.3137 1421.8321 1428.6448 1442.0674 1442.5663 1457.2444 1461.1971 1461.9878 1468.9874 1476.9181 1477.7948 1480.9857 1487.7512 1506.5015 1551.9214 1569.6413 1579.6868 1604.3205 1631.3393 2846.9371 2855.8005 2870.2020 2984.0232 2998.4078 3000.8054 3016.0755 3028.9082 3054.5174 3074.6166 3081.9213 3086.1610 3122.6088 3130.5547 3132.5543 3145.6437 3147.3724 3160.5930 3160.6946 3164.1172 3178.0562
redmass: 2.6508 4.4004 4.2633 6.9953 5.3771 5.3566 3.1117 3.7230 4.6897 3.2855 4.9076 5.6311 4.6714 3.2963 2.3723 1.1654 1.4574 4.4807 3.2275 7.0226 4.6060 2.6770 4.9592 5.5913 4.1505 2.5852 4.0776 4.7835 3.8416 5.0987 3.1876 5.0608 4.0372 6.5184 3.6296 4.0134 4.9842 4.7931 5.8873 3.9008 5.9869 5.3221 4.4635 1.3207 1.3840 1.7278 3.1690 3.1159 4.9341 1.4389 3.2271 1.8275 1.9466 1.3531 5.1114 1.6566 2.4387 1.3376 1.4064 1.3489 2.5250 2.3056 2.1012 1.6185 4.4291 2.8764 1.6443 1.9482 1.7344 3.3016 1.7530 1.5129 1.3945 1.3243 1.3875 1.1907 1.5811 1.4834 1.7815 1.7907 2.5530 2.2607 1.8975 1.2308 1.9148 1.3711 2.2343 3.4144 1.9109 1.4069 5.5659 3.0814 1.1449 2.5140 3.5669 1.1641 3.6992 1.0901 1.9990 1.1782 1.0678 1.0766 1.1086 1.0711 1.0652 3.5712 6.9680 8.2694 7.1838 6.3114 7.0935 1.0570 1.0619 1.0637 1.0654 1.0766 1.0742 1.0723 1.0730 1.1017 1.1009 1.0961 1.0993 1.0863 1.0880 1.0879 1.0868 1.0947 1.0924 1.0960 1.1004 1.0996
irintensity: 0.4834 0.0345 0.1317 0.7202 1.5988 0.7110 0.5325 0.3218 1.6420 0.5183 0.0745 0.2690 2.2849 2.8533 0.6425 1.2805 0.8077 2.4711 2.9120 3.4112 1.7034 7.3971 1.3303 5.3538 1.0417 0.1583 3.6597 5.4764 3.0229 0.9641 5.4357 6.8190 1.6915 0.8873 4.9474 6.1313 6.1466 1.4772 4.4743 7.0691 6.6213 17.4693 33.4048 31.8779 54.7702 23.1019 7.1844 6.2224 5.1834 73.0084 16.5007 4.4582 5.2985 0.1988 16.4295 1.7004 5.2927 1.5274 3.6113 0.0509 3.2986 14.7463 45.4489 8.0826 23.2822 27.2849 2.8658 17.5780 7.1675 36.5251 4.1160 7.3338 3.1561 0.8146 7.4365 3.6700 17.4558 14.5482 1.7789 52.2772 29.8797 6.1158 23.4948 4.6327 99.4400 18.6092 7.8303 22.6362 2.5873 2.9508 42.0178 12.0156 2.7450 12.3447 9.6384 3.5110 264.8222 4.4164 23.3475 4.1969 7.0364 17.1352 12.0522 14.9702 23.0217 33.9053 33.6770 5.7468 16.8350 14.4339 35.5600 70.6452 59.4882 127.4622 22.6572 24.8335 36.1792 51.1980 50.5165 33.3338 28.9123 23.9098 50.8281 2.3108 4.5377 7.7218 1.6851 22.4156 3.1281 18.2078 34.2751 12.3303
temp: 298.150 k
press: 1.00000 atm
elementType: 17 16 7 7 6 6 6 6 6 6 6 6 6 6 6 6 6 6 6 6 6 6 6 6 6 1 1 1 1 1 1 1 1 1 1 1 1 1 1 1 1 1 1 1 1 1
symmnumber: 1
zpe: 959958.2 jmol-1
zpe.correction: 0.365629 hartree
zpe.thermalcorrener: 0.387706 hartree
zpe.thermalcorrenthalpy: 0.388650 hartree
zpe.thermalcorrgfe: 0.313311 hartree
zpe.sumelectzpe: -1778.656614 hartree
zpe.sumelectthermal: -1778.634537 hartree
zpe.sumelectthermalent: -1778.633593 hartree
zpe.sumelectthermalfe: -1778.708932 hartree
dipole: 0.4867 -0.1813 -0.5146
dipole: 0.7312
quadrupole: -148.8181 -166.5642 -150.9392
quadrupole: 3.4245 6.4429 4.5872
quadrupole: 6.6224 -11.1237 4.5013 3.4245 6.4429 4.5872
hfenergy: -1779.0222428 hartree
pointgroup: C01 [X(C21H21Cl1N2S1)]
dipole: 0.1844225 -0.1108801 -0.1908953 debye
polarizability: 372.5263781|30.368776|213.4361534|-19.2979956|38.3802256|247.8526892 unknown
InChI: InChI=1S/C21H21ClN2S/c1-23(2)13-6-14-24-18-12-11-15-7-3-4-8-16(15)21(18)25-19-10-5-9-17(22)20(19)24/h3-5,7-12H,6,13-14H2,1-2H3
charge 0 multiplicity 1
46 atoms
Cl -3.485044 -1.262847 2.620696
S  0.134386 -0.911853 -1.684523
N  -1.101073 0.005652 0.924214
N  -1.517482 3.949618 -1.220669
C  -1.829089 1.174747 1.497194
C  0.328092 -0.007278 0.947182
C  -1.409333 2.516218 0.853034
C  -1.794782 -1.091572 0.346205
C  1.065328 -0.478056 -0.151646
C  -1.809942 2.61626 -0.632537
C  -1.332006 -1.665671 -0.875518
C  2.497805 -0.562867 -0.124474
C  1.032219 0.439469 2.116255
C  3.191157 -0.084018 1.058317
C  2.423219 0.417693 2.15947
C  -2.925097 -1.725239 0.93751
C  -1.982805 -2.748217 -1.496375
C  3.277153 -1.067101 -1.218965
C  4.622555 -0.125253 1.094294
C  -3.627016 -2.770951 0.307247
C  -3.15922 -3.280642 -0.922941
C  -2.233817 4.145942 -2.499212
C  -0.069125 4.205747 -1.374466
C  4.672269 -1.094463 -1.151448
C  5.354935 -0.61762 0.011852
H  -1.697449 1.222259 2.595554
H  -2.904413 1.007858 1.320995
H  -0.320209 2.660011 0.976619
H  -1.907486 3.335513 1.4070
H  -2.90379 2.454843 -0.71006
H  -1.316736 1.793882 -1.210786
H  0.458476 0.794027 2.977708
H  2.948499 0.774125 3.05307
H  -1.579553 -3.15951 -2.427012
H  2.762417 -1.44609 -2.108419
H  5.136508 0.237312 1.992564
H  -4.504487 -3.202347 0.797136
H  -3.691935 -4.1015 -1.412275
H  -3.320543 4.026989 -2.339663
H  -1.92121 3.427916 -3.300441
H  -2.053451 5.17045 -2.8720
H  0.435764 4.175676 -0.394265
H  0.436941 3.466586 -2.047198
H  0.081653 5.215364 -1.796984
H  5.251022 -1.489187 -1.99375
H  6.449192 -0.645378 0.050008
