program: Gaussian 09
title: 000229964
version: EM64L-G09RevD.01
frameworkgroup: C1[X(C19H12N4O4)]
method: RPBEPBE
basis: SDD
operation: Freq
keyword: #p
keyword: freq=noraman
keyword: PBEPBE/SDD
title: #p freq=noraman PBEPBE/SDD
converged: NO YES NO NO
title: Mulliken charges:
elementType: O O O O N N N N C C C C C C C C C C C C C C C C C C C H H H H H H H H H H H H
charge: -0.182194 -0.273149 -0.207967 -0.203102 0.018680 -0.395670 0.025642 0.016409 0.217758 0.221912 0.205733 0.232450 -0.288919 -0.390595 -0.410788 -0.417923 -0.334105 -0.228088 -0.221623 -0.231683 -0.286996 0.289967 0.270545 -0.279277 -0.497833 0.450407 -0.369564 0.249104 0.253793 0.271007 0.266458 0.232842 0.237174 0.235215 0.241629 0.356390 0.296479 0.335901 0.293984
chargesum: 0.00000
title: Mulliken charges with hydrogens summed into heavy atoms:
elementType: O O O O N N N N C C C C C C C C C C C C C C C C C C C
charge: -0.182194 -0.273149 -0.207967 -0.203102 0.018680 -0.039281 0.025642 0.016409 0.217758 0.221912 0.205733 0.232450 -0.288919 -0.141491 -0.156995 -0.146916 -0.067647 0.004754 0.015551 0.003531 -0.045367 0.289967 0.270545 0.017201 -0.161932 0.450407 -0.075580
polarizability: 5.94459188e+02 -4.68877226e+00 3.55062879e+02 1.44146870e-01 8.85263850e-02 8.97908038e+01
1716.lowfreq: -0.0005 0.0003 0.0006 2.6834 6.1160 6.4210 18.2699 31.4897 50.7722
frequency: 18.1275 31.4735 50.7708 56.6275 69.9476 76.0633 107.2546 130.0043 134.3481 147.3023 160.1081 172.2954 177.2719 238.8226 269.4115 304.1103 308.7367 351.5204 363.5168 381.2287 404.1500 411.3983 416.9721 437.1851 443.0077 477.3983 497.4217 509.4058 514.9795 555.9992 564.3029 615.4592 619.8049 636.9942 650.1899 656.4698 659.9663 681.3493 706.4416 724.9904 726.5943 742.5515 753.5141 760.0528 776.1050 793.9753 810.0782 827.3039 828.5225 862.7802 884.0252 889.5479 898.0387 947.5610 953.0305 961.5328 963.6272 993.2579 994.2711 995.3576 1011.7337 1022.2321 1033.4912 1046.1687 1058.6436 1099.8911 1100.9316 1111.7431 1136.4326 1155.1196 1170.6413 1171.9007 1192.1371 1210.9456 1216.8501 1231.7752 1252.5683 1297.0482 1299.3069 1313.1020 1338.3150 1359.5177 1374.4843 1385.9818 1409.2652 1439.9839 1446.2512 1447.9309 1465.2506 1474.7906 1481.5386 1508.7748 1549.4403 1582.2841 1588.3080 1598.2935 1614.0131 1618.9001 1621.9331 3130.6852 3134.1570 3142.6262 3147.9149 3156.0616 3159.9094 3170.1883 3174.5608 3181.1398 3188.7753 3201.9745 3288.6443
redmass: 8.1606 6.5413 7.3545 12.6408 6.6477 7.8456 5.4677 8.8300 3.7183 7.6900 5.5630 7.0986 9.8532 5.5255 5.0866 6.5144 9.2530 4.5318 12.4889 10.0061 2.9932 7.1416 6.5139 3.8999 4.0477 3.7719 10.5650 5.5941 3.5916 6.6682 3.1393 7.0683 7.9078 6.7511 7.4656 4.2353 7.0254 8.9499 7.7119 4.4181 5.8914 1.4545 12.3779 1.4264 6.5258 2.2418 2.6118 1.3848 6.0233 1.4388 7.5670 1.4591 1.6399 6.4914 1.4441 1.4369 1.4113 1.3616 6.7107 1.3484 1.3214 2.2719 3.0086 2.2093 2.6262 2.8512 2.5942 2.0804 1.3585 2.6012 1.6832 1.5253 1.3920 6.2782 2.1516 1.8004 2.3454 2.0185 1.7575 1.6391 4.8746 6.7652 8.6159 5.1842 3.2753 2.2977 3.1092 4.7049 2.7568 3.0522 3.9026 3.3506 9.5007 5.8449 5.5692 7.1187 7.1568 7.3741 7.4389 1.0863 1.0865 1.0901 1.0905 1.0945 1.0943 1.1000 1.0993 1.0897 1.0920 1.0960 1.0778
irintensity: 0.2319 0.6304 0.3553 0.0228 0.2018 1.6736 5.0172 0.6969 0.0048 2.1326 2.3190 0.6412 4.4112 0.2693 0.3551 0.1016 1.0019 1.5032 0.5440 3.2672 1.9218 14.7604 10.1810 5.6608 0.2545 1.0357 3.5178 0.7702 13.1755 2.1334 0.0301 1.0761 5.5603 6.6298 22.5684 8.0578 5.3739 7.9732 5.4000 4.3161 1.3815 98.4990 17.0798 17.1097 5.1285 14.2471 8.4554 108.6591 9.2268 28.1028 6.3824 8.4596 1.0047 13.6921 6.2620 4.1084 25.6459 0.0216 1.7014 0.0152 0.0471 6.2735 25.6649 11.4058 120.9211 37.6726 35.3891 8.4469 66.4597 65.6440 141.0229 95.9690 66.3139 630.7356 1.2550 145.2459 5.2036 64.4328 6.9184 24.7333 342.3103 88.6565 5.0468 36.9766 5.3816 43.2339 35.9148 13.8368 5.1716 1.5435 165.7427 98.5034 5.2310 147.9190 12.4083 1.8299 60.7145 167.3106 346.5511 2.2860 2.6780 5.1209 5.3723 18.6602 23.0239 35.5031 16.0883 3.9107 22.6803 0.0455 55.4229
temp: 298.150 k
press: 1.00000 atm
elementType: 8 8 8 8 7 7 7 7 6 6 6 6 6 6 6 6 6 6 6 6 6 6 6 6 6 6 6 1 1 1 1 1 1 1 1 1 1 1 1
symmnumber: 1
zpe: 727384.0 jmol-1
zpe.correction: 0.277046 hartree
zpe.thermalcorrener: 0.297943 hartree
zpe.thermalcorrenthalpy: 0.298887 hartree
zpe.thermalcorrgfe: 0.225518 hartree
zpe.sumelectzpe: -1249.120353 hartree
zpe.sumelectthermal: -1249.099456 hartree
zpe.sumelectthermalent: -1249.098511 hartree
zpe.sumelectthermalfe: -1249.171880 hartree
dipole: 8.5982 -1.4204 0.0089
dipole: 8.7148
quadrupole: -176.3712 -150.8347 -158.4679
quadrupole: 0.0111 0.1441 0.1333
quadrupole: -14.4799 11.0566 3.4233 0.0111 0.1441 0.1333
hfenergy: -1249.3973985 hartree
pointgroup: C01 [X(C19H12N4O4)]
dipole: 3.4188675 -0.2363206 -0.1057712 debye
polarizability: 592.4339633|17.1086202|354.8932451|-19.7504821|-20.0454218|91.9856623 unknown
InChI: InChI=1S/C19H12N4O4/c24-22(25)12-9-10-17(18(11-12)23(26)27)20-21-19-15-7-3-1-5-13(15)14-6-2-4-8-16(14)19/h1-11,20H
charge 0 multiplicity 1
39 atoms
O  -3.899658 2.849746 -0.144207
O  -1.636359 2.611959 -0.208678
O  -6.02924 -3.028776 0.392884
O  -6.860834 -0.903384 0.264362
N  0.493451 -0.648386 -0.043662
N  -0.559396 0.239222 -0.069398
N  -2.849512 2.10764 -0.125142
N  -5.882756 -1.747272 0.289396
C  4.091005 -0.418083 -0.185676
C  3.766507 1.021014 -0.276086
C  2.865406 -1.14336 -0.092814
C  2.337008 1.18331 -0.239118
C  1.735643 -0.181182 -0.121682
C  5.32257 -1.098593 -0.17922
C  4.617195 2.134278 -0.382649
C  2.854703 -2.546612 0.00679
C  1.778269 2.480283 -0.311804
C  5.315229 -2.513064 -0.078718
C  4.046356 3.42958 -0.454418
C  4.09515 -3.230131 0.013188
C  2.642701 3.598395 -0.419454
C  -1.854517 -0.23314 0.01561
C  -2.992448 0.656943 -0.008263
C  -2.111186 -1.638095 0.132365
C  -4.310476 0.156981 0.081605
C  -4.506771 -1.223129 0.194899
C  -3.410109 -2.130365 0.220783
H  6.271826 -0.556535 -0.249718
H  5.704719 2.008306 -0.409946
H  1.908252 -3.090833 0.0772
H  0.703838 2.680382 -0.290203
H  6.264012 -3.060704 -0.072003
H  4.695706 4.307716 -0.537635
H  4.114654 -4.32247 0.089636
H  2.213083 4.603745 -0.476014
H  -0.468263 1.268564 -0.149186
H  -1.247449 -2.30459 0.149728
H  -5.158694 0.845867 0.062412
H  -3.610416 -3.201125 0.310236
