program: Gaussian 09
title: 000229962
version: EM64L-G09RevD.01
frameworkgroup: C1[X(C10H9Cl3O3)]
method: RPBEPBE
basis: SDD
operation: Freq
keyword: #p
keyword: freq=noraman
keyword: PBEPBE/SDD
title: #p freq=noraman PBEPBE/SDD
converged: YES YES NO NO
title: Mulliken charges:
elementType: Cl Cl Cl O O O C C C C C C C C C C H H H H H H H H H
charge: -0.007423 -0.014608 -0.003830 -0.251443 -0.293173 -0.234649 -0.355006 -0.231065 0.503489 -0.334659 -0.251167 -0.103125 -0.189966 -0.119566 0.311560 -0.749648 0.247125 0.228882 0.236557 0.259561 0.310688 0.283688 0.257596 0.248671 0.251510
chargesum: 0.00000
title: Mulliken charges with hydrogens summed into heavy atoms:
elementType: Cl Cl Cl O O O C C C C C C C C C C
charge: -0.007423 -0.014608 -0.003830 -0.251443 -0.293173 -0.234649 0.121002 0.265054 0.503489 -0.334659 0.059521 -0.103125 0.093722 -0.119566 0.311560 0.008130
polarizability: 1.74763633e+02 1.34319528e+01 1.85851273e+02 1.26199025e+01 -3.04133101e+00 8.17664111e+01
1716.lowfreq: -7.3806 -0.8041 -0.0019 -0.0015 -0.0006 1.0605 11.3860 19.3776 24.4236
frequency: 10.9264 19.2173 24.3150 42.5223 50.5139 78.9445 110.2344 138.0900 164.1444 179.0743 184.8394 200.0082 223.2186 287.3731 300.6562 316.6046 349.8699 397.9240 412.2809 441.9778 451.3677 494.8733 546.2357 564.4767 604.1201 606.8174 646.9554 679.7125 695.0333 783.4868 817.4556 847.1339 866.9973 896.2748 918.1645 989.7176 1009.3293 1032.1352 1039.2183 1043.9705 1102.9467 1123.8275 1188.2396 1207.1726 1229.6331 1250.5674 1273.0088 1326.3794 1359.0457 1365.4047 1373.8998 1387.8054 1449.8368 1451.2088 1455.1807 1456.6214 1459.0166 1555.6543 1588.5969 1660.9292 3006.4735 3006.8990 3012.6142 3082.3898 3087.3058 3099.8123 3140.3554 3178.1853 3180.6898
redmass: 1.4482 3.4621 4.1098 6.4484 5.0328 10.4262 6.2537 9.1815 9.7190 8.4374 4.6985 7.2672 5.5687 3.5242 6.0188 17.1766 12.1394 3.0175 6.4740 3.0850 3.0182 9.1467 4.1701 3.2277 9.8540 4.6384 7.2182 4.8216 4.2033 3.4283 5.2803 1.5008 1.3951 4.3191 4.5657 1.8413 3.0499 3.0810 4.3347 1.6924 2.7552 1.8943 3.3793 1.1085 3.7499 1.2460 1.2068 4.7923 1.4274 1.8478 3.5733 1.2370 1.0703 1.1804 1.1823 1.1574 1.7123 8.9281 8.0184 10.0339 1.0561 1.0418 1.0617 1.1034 1.1049 1.0941 1.1024 1.0918 1.0931
irintensity: 1.1374 0.0482 0.6632 1.8619 0.9191 0.4334 2.3658 0.2507 1.1320 3.6443 6.6780 5.9419 1.5244 6.4676 2.4967 1.9047 2.7968 2.8076 1.0467 19.9601 1.3126 15.1580 0.8014 3.9206 0.7838 3.0246 62.2009 7.1643 7.2369 34.6245 13.2503 2.1633 58.7512 25.8375 72.3781 31.0711 17.6043 68.5544 128.6581 22.5867 13.6338 47.6101 350.4914 5.1008 92.2958 4.6433 32.2492 103.0917 9.2079 15.6031 0.5796 42.3847 4.4672 21.1530 75.5297 51.4836 179.2686 3.4162 29.9004 228.5810 11.9425 2.5045 33.1641 18.8651 12.1559 7.3314 9.1702 23.5920 1.8706
temp: 298.150 k
press: 1.00000 atm
elementType: 17 17 17 8 8 8 6 6 6 6 6 6 6 6 6 6 1 1 1 1 1 1 1 1 1
symmnumber: 1
zpe: 445763.9 jmol-1
zpe.correction: 0.169783 hartree
zpe.thermalcorrener: 0.186858 hartree
zpe.thermalcorrenthalpy: 0.187802 hartree
zpe.thermalcorrgfe: 0.119646 hartree
zpe.sumelectzpe: -1991.109685 hartree
zpe.sumelectthermal: -1991.092609 hartree
zpe.sumelectthermalent: -1991.091665 hartree
zpe.sumelectthermalfe: -1991.159821 hartree
dipole: 1.6846 -0.0864 1.7860
dipole: 2.4566
quadrupole: -122.5181 -114.3766 -111.4029
quadrupole: -3.5354 9.2744 4.8566
quadrupole: -6.4189 1.7226 4.6963 -3.5354 9.2744 4.8566
hfenergy: -1991.2794674 hartree
pointgroup: C01 [X(C10H9Cl3O3)]
dipole: -0.5550153 -0.744471 0.2680688 debye
dipolederiv: -0.0733512 -0.0040668 0.0802611 -0.0149672 -0.0494677 -0.0736948 0.0488986 -0.0916544 -0.7462938 -0.0909768 0.0004815 0.0979446 -0.0169537 -0.0515779 -0.0703371 0.0176909 -0.085841 -0.7213838 -0.5064876 -0.2394639 -0.2473994 -0.2562762 -0.1524951 -0.1350551 -0.2438944 -0.1300822 -0.2058875 -1.5074395 -0.5157364 -0.2960743 -0.6224421 -0.5765221 -0.1350939 -0.3899428 -0.2095002 -0.3628909 -1.1581433 0.396584 0.2822781 0.5994346 -0.7267648 -0.3960728 0.385015 -0.4002874 -0.6808532 -1.0617133 0.2022285 0.0038898 0.1274283 -0.4202959 -0.1417271 -0.3174754 -0.0197143 -0.4973113 0.9791492 0.2950199 0.034672 0.3651815 0.4420652 -0.0015529 -0.2395157 -0.1397955 0.1740227 0.1467129 0.0118886 -0.0192091 -0.089053 0.3809925 0.1252745 -0.1681049 0.2507746 0.49263 1.0772155 0.4277703 0.3318578 0.5046693 0.3493579 0.1496107 0.7691779 0.3403351 0.0609983 -0.1430833 -0.0382387 -0.2208443 -0.0641573 -0.1284903 0.0554026 -0.0944772 0.1451445 1.1154903 -0.2658309 -0.0526962 0.0606991 -0.0798403 -0.1644999 0.0159776 -0.2615109 -0.1207971 -0.316297 0.0707116 0.0228157 -0.2135523 0.0501787 -0.0196121 0.0800861 -0.1240644 0.0773063 1.0150155 -0.1415623 -0.0426503 0.0167877 -0.0592469 -0.0623704 -0.0119754 -0.0612777 -0.0557168 -0.194137 0.6137631 0.3572094 0.3687015 0.373796 0.1149144 0.1623724 0.4463879 0.2022945 -0.0047874 1.7106704 -0.5702139 -0.1703238 -0.6500982 0.7592912 0.5592076 0.0470739 0.3808075 0.8342123 -0.0587476 -0.0484505 -0.087244 -0.0112376 -0.1463856 -0.2216749 -0.0156783 -0.1723751 -0.2243035 -0.0410926 -0.0656313 -0.002422 -0.0775912 -0.0091556 -0.0807388 -0.0067491 -0.1245176 0.0027011 -0.0353026 0.0274663 -0.0540036 -0.0360798 0.0394822 0.040691 0.0116041 0.1557754 -0.0248542 -0.050621 -0.1268145 -0.0076845 -0.0457566 -0.0291098 -0.0383858 0.0960769 -0.0158039 0.0315083 0.1139639 0.019549 -0.0131168 0.0628456 -0.0215237 0.047439 0.0218982 -0.0071167 -0.0452998 0.2306325 -0.0486392 0.0062209 -0.0545415 0.1435197 -0.0110719 0.0469386 -0.0115818 0.0609259 0.0612865 -0.0437625 0.0305922 -0.0421033 0.1490699 0.0060662 0.034083 0.0021476 0.0705943 0.1106546 -0.0756848 0.0065981 -0.0738113 0.000977 0.0383881 0.0254365 0.0506194 0.0630046 0.0583117 0.0789654 -0.0837324 0.0816342 0.051896 0.0589092 -0.0807958 0.0204977 0.058067 -0.0387198 0.0320706 0.0951037 0.0289884 0.1267046 -0.0220445 0.0532051 -0.0409184 0.0451291 unknown
polarizability: 169.186806|28.2629214|95.5561055|5.4678952|27.3742405|177.6384054 unknown
InChI: InChI=1S/C10H9Cl3O3/c1-6(14)15-2-3-16-10-5-8(12)7(11)4-9(10)13/h4-5H,2-3H2,1H3
charge 0 multiplicity 1
25 atoms
Cl 1.863365 -0.165518 -3.421187
Cl 1.423792 0.562916 2.945511
Cl 4.129811 1.551809 1.328933
O  -0.42333 -0.987241 -1.720632
O  -2.56468 -0.342841 0.508575
O  -4.725391 0.500182 0.301023
C  -1.467235 -1.824826 -1.095391
C  -2.748465 -1.061027 -0.780425
C  0.582557 -0.415922 -0.94303
C  1.743766 0.035391 -1.62734
C  0.513872 -0.242465 0.459916
C  1.585223 0.352993 1.152196
C  2.809548 0.632695 -0.935043
C  2.735517 0.78894 0.466053
C  -3.653454 0.442657 0.938892
C  -3.307702 1.180665 2.211114
H  -1.692166 -2.575897 -1.872077
H  -1.073853 -2.341442 -0.199556
H  -3.598002 -1.762204 -0.677691
H  -2.98876 -0.335885 -1.57742
H  -0.395389 -0.514439 0.999989
H  3.697148 0.968496 -1.477138
H  -2.828078 2.143368 1.955097
H  -2.600372 0.606213 2.829105
H  -4.227722 1.394681 2.775426
