program: Gaussian 09
title: 000021738
version: EM64L-G09RevD.01
frameworkgroup: C1[X(C11H9N3O3)]
method: RPBEPBE
basis: SDD
operation: Freq
keyword: #p
keyword: freq=noraman
keyword: PBEPBE/SDD
title: #p freq=noraman PBEPBE/SDD
converged: YES YES NO NO
title: Mulliken charges:
elementType: O O O N N N C C C C C C C C C C C H H H H H H H H H
charge: -0.266108 -0.400626 -0.235754 -0.046533 -0.386783 -0.005031 0.081779 0.065833 0.073269 -0.336776 0.169192 -0.309595 -0.384956 -0.389060 -0.212485 -0.214709 0.170679 0.265986 0.265626 0.286698 0.377420 0.281473 0.281489 0.239103 0.239054 0.390815
chargesum: 0.00000
title: Mulliken charges with hydrogens summed into heavy atoms:
elementType: O O O N N N C C C C C C C C C C C
charge: -0.266108 -0.009811 -0.235754 -0.046533 -0.009363 -0.005031 0.081779 0.065833 0.073269 -0.070790 0.169192 -0.043969 -0.098257 0.173902 0.026618 0.024345 0.170679
polarizability: 2.29919173e+02 2.79301437e+01 1.70430677e+02 1.07505615e-01 -6.11445099e-02 6.14924969e+01
1716.lowfreq: -0.0004 0.0003 0.0005 0.4076 2.3336 9.8976 25.3725 46.6021 50.5431
frequency: 25.2259 46.5797 50.5408 69.5652 83.4167 161.3505 164.9611 182.9570 242.7717 273.4188 277.6201 338.3020 412.2228 431.9403 487.4412 491.5006 495.6456 515.8581 533.8767 576.7078 595.4567 609.2189 631.6145 634.4864 743.5678 746.3223 748.2206 781.6476 781.7440 809.2265 868.9245 890.8538 914.6513 949.4600 964.6330 977.6464 987.3097 1003.2873 1010.4597 1038.8285 1098.3742 1112.8457 1156.4102 1185.8775 1195.4168 1201.1234 1238.5894 1259.9337 1274.9820 1275.9959 1323.0460 1369.8619 1378.6108 1414.0209 1453.9566 1460.0695 1478.4275 1498.2678 1517.4233 1550.9754 1600.0905 1617.1535 1670.0954 2988.5416 3026.5469 3138.8806 3151.9010 3165.9391 3166.3111 3176.1337 3460.4990 3522.4533
redmass: 5.0170 9.0756 7.5969 5.1208 6.4766 6.9559 3.2341 4.2479 8.4187 8.3817 5.4526 7.8774 4.4190 5.2755 2.9641 3.3808 2.4407 6.1961 5.5504 6.6827 6.7280 9.5487 1.4937 3.4633 1.5539 6.2162 1.8140 1.5102 7.0650 3.1438 5.6980 1.7170 4.4825 1.4543 5.3355 1.3664 2.0868 1.3330 2.1177 3.6112 2.8003 1.8431 1.2756 2.1194 1.8630 1.0884 2.0697 1.7076 3.6491 1.8451 2.6532 2.3130 2.5589 4.8739 2.1457 1.2218 3.6214 2.7902 7.1980 6.9908 10.9727 6.5237 8.3692 1.0599 1.0994 1.0862 1.0897 1.0938 1.0953 1.1005 1.0776 1.0642
irintensity: 0.5828 1.5873 1.1594 4.1834 0.5237 12.3981 2.3553 1.5197 0.8899 0.7556 7.9757 9.2607 13.5381 48.0925 12.8229 10.2500 9.8585 17.2892 31.1240 5.5767 7.4190 1.3141 116.3808 18.9134 64.4522 2.6852 22.8015 120.7741 12.9470 10.7581 0.9272 0.0588 30.7585 10.1735 19.9856 6.8249 1.6845 0.0000 12.2492 198.8776 142.9290 29.2112 2.7692 4.3145 2.7951 0.0013 4.5432 4.1317 7.2661 6.6266 11.8371 117.3888 43.3673 10.4501 11.3656 21.1692 54.4262 355.1432 6.9746 18.9549 230.9392 6.2237 139.5817 31.0355 5.6922 2.3662 5.5007 4.2140 6.7627 22.4813 60.1376 41.4544
temp: 298.150 k
press: 1.00000 atm
elementType: 8 8 8 7 7 7 6 6 6 6 6 6 6 6 6 6 6 1 1 1 1 1 1 1 1 1
symmnumber: 1
zpe: 494525.6 jmol-1
zpe.correction: 0.188355 hartree
zpe.thermalcorrener: 0.202586 hartree
zpe.thermalcorrenthalpy: 0.203530 hartree
zpe.thermalcorrgfe: 0.144976 hartree
zpe.sumelectzpe: -813.321875 hartree
zpe.sumelectthermal: -813.307644 hartree
zpe.sumelectthermalent: -813.306700 hartree
zpe.sumelectthermalfe: -813.365254 hartree
dipole: -0.2234 -3.9070 -0.0018
dipole: 3.9134
quadrupole: -69.4569 -104.5024 -98.5378
quadrupole: -0.3968 -0.0095 -0.0159
quadrupole: 21.3755 -13.6700 -7.7054 -0.3968 -0.0095 -0.0159
hfenergy: -813.5102302 hartree
pointgroup: C01 [X(C11H9N3O3)]
dipole: -0.1812214 -1.5124576 -0.2239764 debye
dipolederiv: -0.7839511 -0.2772241 -0.0554049 0.1499561 -0.8874326 -0.0709982 0.0060796 -0.0859934 -0.3684275 -1.4936544 0.0824214 -0.0273297 0.1974279 -0.2597577 0.0308556 -0.0105934 0.0266863 -0.4186325 -0.8698334 -0.0058803 -0.0215384 -0.1775031 -0.7965932 -0.0778314 -0.0462448 -0.0715599 -0.3176454 -0.1744656 0.100151 0.0168565 0.1204133 -0.1971717 0.0104947 0.0203568 0.0097101 -0.2358526 -1.0550328 0.2604285 0.0138133 0.527866 -0.7878379 -0.0351393 0.0521327 -0.0445842 -0.4127908 -0.1704843 0.0173843 0.0062931 0.1086327 -0.1481362 0.0211225 0.0189752 0.0176818 -0.2658087 -0.2666973 -0.0943381 -0.0281938 0.4254271 0.1531601 0.0195594 0.0452011 0.0001319 0.1286045 0.2491004 0.3171678 0.0504109 -0.2514175 -0.1381572 -0.0439453 -0.0300309 -0.0224967 0.1020538 0.0674814 0.0071037 -0.0012407 -0.4239875 -0.158314 -0.0558203 -0.0626395 -0.0396368 0.113798 -0.01617 -0.0966811 -0.0080725 -0.044105 0.0433685 0.0272072 -0.0006817 0.025313 -0.1577814 1.4280793 0.0302383 0.0499254 -0.4811577 1.2701474 0.1384645 -0.0235612 0.1563166 0.2055151 -0.0121305 -0.1464508 -0.0155744 -0.1604023 0.0116792 0.0163693 -0.0175361 0.0168016 -0.1449098 -0.2072605 -0.1101496 -0.0242673 0.1561466 0.2795482 0.0416407 0.0134279 0.0315727 0.0329078 0.6060947 -0.0844374 -0.0016419 0.1855741 -0.2165927 -0.0700411 0.0370049 -0.0794848 0.3042551 -0.1592262 0.027169 0.0031576 0.1027358 0.1874328 0.0500468 0.0137041 0.0471813 -0.1321754 0.193664 0.0025794 0.0130693 -0.0666094 -0.0908448 0.0042552 0.0032038 0.0068238 -0.1375338 1.8450237 -0.075559 0.0491844 -0.1364861 1.1324064 0.1296973 0.0403406 0.1317328 0.2248585 0.0468462 0.0952964 0.0089608 0.0362108 0.0087767 -0.0206488 0.0006595 -0.0184733 0.1621881 0.0255817 0.037315 0.0000571 0.0991169 0.0170815 -0.0168703 0.0087493 -0.0192255 0.1605042 0.1224279 -0.0533464 -0.0078181 -0.05066 0.0363171 -0.0148647 -0.0072676 -0.0148736 0.1254852 0.4030355 -0.00939 0.0020884 -0.1372514 0.2411185 -0.0146131 -0.0165776 -0.01004 0.3062012 -0.0409298 0.0591581 -0.0341171 -0.0244185 0.1002588 -0.0343912 -0.0892386 -0.0168647 -0.0086731 -0.0492133 0.0454758 0.0453153 -0.0517137 0.0777904 0.0559136 0.07481 0.0445631 0.0226241 0.0545954 -0.0694304 -0.013836 -0.0798864 -0.0764355 -0.0364923 -0.0153105 -0.0360714 0.1547735 -0.1132125 -0.0315792 -0.0148736 -0.0361199 0.0892309 -0.0114013 -0.0154709 -0.0112137 0.1580272 0.3703315 -0.0274224 -0.0052234 0.0122113 0.1089568 -0.0425697 0.0005073 -0.043997 0.3984347 unknown
polarizability: 232.8652347|22.9614671|164.9085853|9.6188796|15.582786|64.0685263 unknown
InChI: InChI=1S/C11H9N3O3/c15-10(16)6-13-11(17)9-5-12-7-3-1-2-4-8(7)14-9/h1-5,13,15H,6H2
charge 0 multiplicity 1
26 atoms
O  1.952082 2.36129 0.518992
O  5.610545 -1.275188 0.127802
O  3.549775 -2.33269 -0.101054
N  -0.473626 -0.288092 0.053134
N  2.205808 0.062042 0.199116
N  -2.268725 1.950044 0.302246
C  -1.845393 -0.47198 -0.024393
C  -2.749681 0.657668 0.101053
C  -0.034161 0.973642 0.248229
C  -2.375134 -1.783253 -0.229757
C  1.455478 1.202884 0.335425
C  -4.158333 0.440389 0.016499
C  -0.932147 2.090827 0.372887
C  3.658968 0.105701 0.25685
C  -3.758034 -1.966105 -0.308506
C  -4.651772 -0.851872 -0.185196
C  4.219229 -1.29163 0.07455
H  -1.672595 -2.617423 -0.320869
H  -4.818259 1.307738 0.114032
H  -0.520916 3.091873 0.530158
H  1.723476 -0.834696 0.052474
H  4.01481 0.520741 1.220364
H  4.076158 0.772795 -0.523056
H  -4.168679 -2.969144 -0.465867
H  -5.73197 -1.020722 -0.250216
H  5.964697 -2.197439 0.006601
