program: Gaussian 09
title: 000229930
version: EM64L-G09RevD.01
frameworkgroup: C1[X(C12H8Cl2O3S)]
method: RPBEPBE
basis: SDD
operation: Freq
keyword: #p
keyword: freq=noraman
keyword: PBEPBE/SDD
title: #p freq=noraman PBEPBE/SDD
converged: YES YES NO NO
title: Mulliken charges:
elementType: Cl Cl S O O O C C C C C C C C C C C C H H H H H H H H
charge: -0.043464 -0.038548 0.636910 -0.406989 -0.396499 -0.627789 -0.265406 -0.310123 0.250697 0.352098 -0.111836 -0.240790 -0.293836 -0.296722 -0.132987 -0.110608 -0.189634 -0.170016 0.277058 0.280974 0.269061 0.270376 0.262918 0.263843 0.388503 0.382809
chargesum: 0.00000
title: Mulliken charges with hydrogens summed into heavy atoms:
elementType: Cl Cl S O O O C C C C C C C C C C C C
charge: -0.043464 -0.038548 0.636910 -0.018487 -0.013689 -0.627789 -0.265406 -0.310123 0.250697 0.352098 0.165221 0.040184 -0.024775 -0.026347 -0.132987 -0.110608 0.073284 0.093826
polarizability: 2.26959940e+02 -2.61756520e+01 1.95764456e+02 1.44996965e+00 -6.19358957e+00 1.18130611e+02
1716.lowfreq: -7.2355 -5.7589 -0.0033 -0.0031 -0.0023 5.0710 23.7061 33.3349 40.8966
frequency: 23.6276 33.3179 40.8900 119.9118 122.2250 141.8079 145.0818 166.0140 218.1037 261.7517 284.0561 311.2077 317.2776 322.0113 348.6754 359.6048 365.6720 377.4349 380.4138 434.0351 461.2197 487.7156 513.0928 535.4930 550.5436 624.0685 625.0253 655.0825 665.9887 671.3207 696.8318 703.1487 816.7366 820.6301 823.8742 826.5250 855.4134 866.7322 876.0382 952.0443 955.7116 959.5810 997.1620 1015.5630 1074.4536 1077.5645 1125.1531 1127.9967 1226.5971 1231.9791 1245.2168 1262.6803 1317.6638 1327.8605 1394.6850 1397.9987 1440.4553 1450.0179 1454.5101 1485.1454 1570.3401 1579.8187 1598.1833 1604.0046 2673.1318 2872.9074 3151.5104 3156.3636 3164.5363 3165.2542 3183.6270 3184.2390
redmass: 11.4066 13.7692 6.7570 7.3560 8.5506 6.8167 9.8047 10.3686 8.3115 9.4270 10.2713 8.6161 7.8885 7.1549 11.7519 10.7508 8.8158 8.1149 9.2310 3.5651 3.6778 4.8183 5.0979 3.8475 4.6704 8.3748 8.3831 10.6141 12.2208 8.2707 3.9326 3.9787 6.6414 1.4873 2.9867 2.0037 1.4116 1.3549 1.0814 1.0889 1.3265 1.3182 4.6432 4.2733 2.3552 2.2742 1.4080 1.3920 1.3950 1.3986 3.2983 3.2141 2.0851 2.4693 5.7641 6.2930 1.9961 2.6358 2.2881 1.9594 4.5670 3.4076 6.4171 5.0405 1.0724 1.0699 1.0930 1.0922 1.0887 1.0888 1.0976 1.0975
irintensity: 0.0193 0.0178 0.0139 1.4047 2.0304 0.4321 2.0530 0.5416 2.9317 2.6546 6.2842 0.5612 2.6355 20.8358 5.4780 2.1793 0.3655 7.3116 20.2423 9.2158 27.1890 30.4064 52.9016 2.6883 0.2716 57.7493 12.7515 3.0967 23.1148 19.4974 3.2271 1.4174 0.5656 64.0758 22.8736 45.8917 12.7172 14.5343 80.5781 145.1159 7.2214 9.1393 6.8448 23.1896 21.0711 20.7030 6.9844 5.9844 9.9831 31.2976 95.8153 100.3147 42.2024 29.8118 28.6752 3.4705 160.1597 278.2976 67.8162 17.0504 33.8892 33.1866 2.1729 9.7542 676.8432 480.7362 0.6796 2.2182 0.8038 0.7731 1.5916 0.9347
temp: 298.150 k
press: 1.00000 atm
elementType: 17 17 16 8 8 8 6 6 6 6 6 6 6 6 6 6 6 6 1 1 1 1 1 1 1 1
symmnumber: 1
zpe: 444248.5 jmol-1
zpe.correction: 0.169205 hartree
zpe.thermalcorrener: 0.185508 hartree
zpe.thermalcorrenthalpy: 0.186452 hartree
zpe.thermalcorrgfe: 0.123627 hartree
zpe.sumelectzpe: -2004.575700 hartree
zpe.sumelectthermal: -2004.559398 hartree
zpe.sumelectthermalent: -2004.558454 hartree
zpe.sumelectthermalfe: -2004.621278 hartree
dipole: -0.7331 1.6041 -0.5023
dipole: 1.8339
quadrupole: -120.4367 -141.9757 -123.4670
quadrupole: 4.9941 -2.3188 0.8279
quadrupole: 8.1897 -13.3492 5.1595 4.9941 -2.3188 0.8279
hfenergy: -2004.7449056 hartree
pointgroup: C01 [X(C12H8Cl2O3S1)]
dipole: 0.1260745 -0.6673015 -0.243659 debye
dipolederiv: -0.1451628 -0.062215 0.0236073 -0.2341079 -0.7554728 0.0663204 0.039897 0.0642506 -0.0619917 -0.2812619 0.2513462 0.1120993 0.3669574 -0.4721802 -0.2370635 0.1888669 -0.2561184 -0.2441142 0.8347049 0.0487314 0.0622808 -0.0718984 0.592635 -0.2342132 0.1448155 -0.1114447 0.5152134 -0.5337215 -0.1278455 0.0206603 -0.1742308 -1.2626331 0.1220064 0.0006857 0.1657253 -0.3894293 -0.6869431 0.3525381 0.1847294 0.4181138 -0.9192563 -0.2599925 0.0002223 -0.273463 -0.5249982 -0.8885412 0.0248464 -0.0201997 0.0638371 -0.6259754 0.1948159 -0.1915772 -0.0636761 -0.5059654 0.0437825 0.2336083 -0.1531875 -0.023196 -0.3417942 0.0694438 -0.0652361 -0.0062004 -0.144799 -0.0917862 -0.1033357 0.0098349 0.126311 -0.2435744 0.0803319 0.1399054 -0.1225154 -0.1844618 -0.0666187 0.215172 -0.0013993 -0.2071697 1.1518591 -0.1090481 0.0880048 -0.0832704 0.0932236 0.2156504 -0.31517 -0.3252966 -0.2180413 0.7254827 0.4633445 -0.1026243 0.2771213 0.2501521 -0.1384655 -0.1704581 0.026241 0.2799225 -0.1828897 -0.0540863 0.0468642 0.042588 -0.0400853 -0.0053535 0.0478214 0.1759328 -0.172464 -0.0806128 -0.2139301 -0.2275677 0.0759102 -0.0920168 -0.0013693 -0.3049487 -0.0408681 0.1484017 -0.1766699 0.003226 -0.0441813 0.0769396 -0.1363701 -0.153007 0.1190103 0.1948331 -0.0558186 -0.2148119 -0.1356431 -0.0374243 0.1558647 0.0579857 -0.1414356 0.1778189 -0.0267221 0.283682 1.0565307 -0.0930776 0.0057295 -0.1364545 -0.0825909 0.1340536 -0.4161334 -0.3045062 -0.4893005 0.6125583 0.4583323 -0.4015159 0.3956767 0.1136772 0.1255732 -0.0003363 -0.0680626 -0.2065346 -0.0739015 0.016865 -0.0566975 0.0067245 -0.0540509 -0.0419319 -0.0243363 0.0827233 0.0866595 -0.0656597 0.0220669 0.210643 -0.0588086 0.1157838 0.1015468 0.0648414 0.0492729 0.0833209 0.0719002 0.0085463 0.0189359 -0.0140551 0.1278375 0.147587 -0.0011138 -0.0596008 0.0080833 0.1180115 -0.0152987 -0.0461458 -0.0260233 0.0299097 0.01186 0.0307944 0.0427864 0.0359923 0.0303279 -0.0111895 0.0501716 -0.0181081 0.1584674 0.1051479 0.0363466 -0.038677 0.0492887 0.0894893 -0.0559817 -0.0609152 -0.0369853 0.0175239 0.0062252 -0.0442397 0.0504426 -0.0586819 0.0858175 0.0230495 0.0532749 0.0231171 0.142265 0.0622572 0.0703824 -0.0531139 0.0870823 0.0860355 0.0265968 -0.0532301 0.01914 0.0927922 0.806795 -0.0573024 -0.0249135 0.0393172 0.4132684 -0.0333677 -0.0635371 -0.0684251 0.321559 0.5804144 -0.0458231 0.0811032 -0.1655259 0.3815159 -0.1020537 0.3626356 -0.0275097 0.4244829 unknown
polarizability: 213.3728245|-29.7504269|207.9117164|-6.1657803|13.0782902|119.5704656 unknown
InChI: InChI=1S/C12H8Cl2O3S/c13-7-1-3-9(15)11(5-7)18(17)12-6-8(14)2-4-10(12)16/h1-6,15-16H
charge 0 multiplicity 1
26 atoms
Cl -2.764301 -3.173402 -0.017444
Cl 4.009162 -2.80786 -1.577954
S  0.265262 1.32929 -1.526586
O  -2.311011 2.826724 -0.51366
O  1.464864 1.818299 1.339201
O  0.29991 2.87125 -0.712156
C  -1.294712 0.571486 -0.75744
C  1.607922 0.376784 -0.658984
C  -2.368651 1.450537 -0.427909
C  2.003277 0.754471 0.659147
C  -1.393298 -0.828233 -0.641266
C  2.218534 -0.682062 -1.36651
C  -3.579506 0.855774 0.020192
C  3.012552 -0.02764 1.28479
C  -2.6085 -1.368189 -0.187955
C  3.213493 -1.422909 -0.7077
C  -3.705861 -0.539818 0.135244
C  3.608533 -1.109524 0.613432
H  -0.548877 -1.482901 -0.87834
H  1.928872 -0.924128 -2.394246
H  -4.405333 1.523237 0.281877
H  3.318411 0.24915 2.2975
H  -4.643668 -0.980722 0.484774
H  4.38749 -1.699231 1.105237
H  -1.332212 3.128056 -0.613035
H  0.932647 2.419662 0.67699
