program: Gaussian 09
title: 000229928
version: EM64L-G09RevD.01
frameworkgroup: C1[X(C14H11NO3)]
method: RPBEPBE
basis: SDD
operation: Freq
keyword: #p
keyword: freq=noraman
keyword: PBEPBE/SDD
title: #p freq=noraman PBEPBE/SDD
converged: YES YES NO NO
title: Mulliken charges:
elementType: O O O N C C C C C C C C C C C C C C H H H H H H H H H H H
charge: -0.241812 -0.427752 -0.231313 -0.459064 0.157040 0.431340 0.356792 -0.332997 -0.461663 -0.375506 -0.422453 -0.235209 -0.273626 -0.241573 0.186551 -0.254332 -0.279661 0.176099 0.190628 0.241182 0.310351 0.241956 0.231992 0.320708 0.231609 0.233540 0.283375 0.258884 0.384916
chargesum: 0.00000
title: Mulliken charges with hydrogens summed into heavy atoms:
elementType: O O O N C C C C C C C C C C C C C C
charge: -0.241812 -0.042836 -0.231313 -0.138357 0.157040 0.431340 0.356792 -0.142368 -0.220482 -0.065155 -0.180497 -0.003217 -0.042017 -0.008033 0.186551 0.029043 -0.020777 0.176099
polarizability: 2.92817467e+02 -6.23449093e-01 2.13512977e+02 -9.24169613e+00 -1.63706644e-01 7.54287781e+01
1716.lowfreq: -6.6187 -0.0003 0.0002 0.0006 2.5450 3.5599 21.6109 39.5007 48.5704
frequency: 21.5850 39.4856 48.5696 69.3037 103.7284 145.4637 164.2348 173.5887 178.1311 201.2498 261.1983 286.5112 376.4729 415.5585 427.6815 435.8102 471.2271 508.9942 510.5449 539.0950 555.0236 582.9581 596.7175 628.1662 642.7960 658.2610 668.6462 724.4963 739.0395 780.1422 783.2995 787.8990 809.6238 854.9776 869.5564 890.0002 923.7817 930.8256 943.3986 953.4883 988.1151 993.8516 996.4838 1030.9234 1048.5911 1062.7560 1094.3799 1154.4736 1184.0410 1192.5162 1218.0007 1223.5042 1237.0155 1263.1107 1276.8654 1283.5753 1327.6292 1362.9370 1408.2807 1417.3138 1442.2112 1454.3748 1488.4816 1532.3959 1583.0872 1588.1815 1598.9448 1634.5757 1636.4524 1648.6599 3104.6716 3127.4807 3132.1459 3143.5412 3144.5897 3149.6296 3156.9819 3165.3575 3196.2730 3524.7091 3547.0494
redmass: 5.8683 6.8106 8.1234 6.5043 4.2431 3.7917 4.8947 3.7559 4.1094 6.3614 8.0335 4.0057 6.4164 3.3344 4.1109 5.9313 3.3541 5.3583 5.4096 4.2073 2.3496 1.8720 4.7641 1.5399 2.6044 2.7489 4.4615 7.6767 1.3120 5.5776 2.1500 5.1354 1.4130 4.3349 1.8955 2.3669 6.8600 1.3505 4.2180 1.4292 1.3428 1.1277 1.3607 3.0470 2.2102 2.2697 2.2212 1.4130 1.1106 1.3189 1.9400 1.4417 1.9449 1.3970 1.7178 2.5926 2.1168 2.4767 2.5567 6.1931 2.6678 2.2874 2.3799 3.0455 5.7506 7.5622 4.6281 6.1987 7.1873 6.4840 1.0872 1.0876 1.0873 1.0978 1.0935 1.0863 1.0967 1.1003 1.0946 1.0642 1.0752
irintensity: 1.5781 0.2348 0.1085 2.8380 1.8809 1.3013 0.6814 5.1346 4.6199 1.8616 1.6742 3.4735 5.0512 15.7900 5.0175 13.1137 0.3865 12.2374 4.9553 51.4563 5.5895 57.3389 11.4644 73.6322 44.1758 3.3129 10.4569 41.5734 18.7779 9.3396 66.2561 7.0504 62.7065 2.0948 22.0101 4.6989 10.3225 3.5247 6.1113 1.4428 0.6637 55.0453 3.5147 22.7855 248.0097 117.5058 3.3240 3.4635 1.1987 6.4461 48.7262 1.5787 8.7237 37.9367 0.8782 6.3726 111.8960 38.6473 38.2921 33.7814 3.3842 0.9770 262.0313 111.3765 169.1308 14.4417 6.3634 65.2040 307.8915 67.4047 21.1718 0.8499 1.7257 8.5642 25.1059 3.4040 31.8471 26.2861 5.4272 56.9630 20.6534
temp: 298.150 k
press: 1.00000 atm
elementType: 8 8 8 7 6 6 6 6 6 6 6 6 6 6 6 6 6 6 1 1 1 1 1 1 1 1 1 1 1
symmnumber: 1
zpe: 571011.6 jmol-1
zpe.correction: 0.217487 hartree
zpe.thermalcorrener: 0.232826 hartree
zpe.thermalcorrenthalpy: 0.233771 hartree
zpe.thermalcorrgfe: 0.172813 hartree
zpe.sumelectzpe: -819.274969 hartree
zpe.sumelectthermal: -819.259629 hartree
zpe.sumelectthermalent: -819.258685 hartree
zpe.sumelectthermalfe: -819.319643 hartree
dipole: -2.2862 4.2415 0.6336
dipole: 4.8599
quadrupole: -96.2963 -101.5929 -109.1536
quadrupole: 11.5894 3.2422 -2.2116
quadrupole: 6.0513 0.7547 -6.8060 11.5894 3.2422 -2.2116
hfenergy: -819.4924557 hartree
pointgroup: C01 [X(C14H11N1O3)]
dipole: -0.972233 1.4328709 0.8108674 debye
polarizability: 291.2074825|9.8418841|199.5684017|-17.7400832|41.5965792|90.9833381 unknown
InChI: InChI=1S/C14H11NO3/c16-13(8-9-14(17)18)15-12-7-3-5-10-4-1-2-6-11(10)12/h1-9,15,17H
charge 0 multiplicity 1
29 atoms
O  1.563351 -2.466746 -1.236653
O  4.834218 1.863297 1.189083
O  5.630936 0.651967 -0.63737
N  0.536971 -0.486044 -0.451232
C  -1.790813 0.167122 0.007045
C  -3.182578 -0.214063 0.1485
C  -0.8287 -0.863685 -0.343756
C  -1.444438 1.543743 0.221716
C  -3.576383 -1.574852 -0.070668
C  -1.249224 -2.188226 -0.556692
C  -4.150791 0.782657 0.503792
C  -2.624957 -2.533082 -0.419299
C  -2.410722 2.493443 0.56591
C  -3.779424 2.111379 0.711876
C  1.630027 -1.259837 -0.844798
C  2.955704 -0.567858 -0.778985
C  3.324614 0.363103 0.147603
C  4.6956 0.927121 0.150287
H  -0.411531 1.897729 0.111526
H  -4.632535 -1.846077 0.037857
H  -0.512055 -2.944392 -0.830172
H  -5.198523 0.476915 0.607926
H  -2.924958 -3.572303 -0.589981
H  0.750152 0.490362 -0.242576
H  -2.117982 3.537301 0.721501
H  -4.528891 2.862546 0.982259
H  3.69893 -0.931849 -1.499327
H  2.660665 0.712345 0.946572
H  5.759038 2.231087 1.178656
