program: Gaussian 09
title: 000229927
version: EM64L-G09RevD.01
frameworkgroup: C1[X(C10H7Cl2NO3)]
method: RPBEPBE
basis: SDD
operation: Freq
keyword: #p
keyword: freq=noraman
keyword: PBEPBE/SDD
title: #p freq=noraman PBEPBE/SDD
converged: NO YES NO YES
title: Mulliken charges:
elementType: Cl Cl O O O N C C C C C C C C C C H H H H H H H
charge: -0.047686 -0.036480 -0.254820 -0.415876 -0.241524 -0.462291 0.627259 -0.355553 -0.305350 -0.206753 -0.211081 -0.114190 0.242267 -0.297159 -0.206544 0.171331 0.322361 0.318166 0.283251 0.262380 0.252416 0.291325 0.384552
chargesum: 0.00000
title: Mulliken charges with hydrogens summed into heavy atoms:
elementType: Cl Cl O O O N C C C C C C C C C C
charge: -0.047686 -0.036480 -0.254820 -0.031324 -0.241524 -0.144125 0.627259 -0.355553 0.017011 0.076498 0.051298 -0.114190 0.242267 -0.044743 0.084780 0.171331
polarizability: 3.15857750e+02 2.98368215e-01 1.49892766e+02 5.75834469e-04 -5.86861763e-05 5.40074686e+01
1716.lowfreq: -3.7470 -0.0021 -0.0001 0.0013 2.7628 10.0275 28.2569 43.7907 51.4005
frequency: 28.2562 43.5915 51.3902 74.9858 120.5662 135.7863 161.0763 166.5925 169.8283 211.7397 216.2035 259.9805 296.1023 357.0430 365.6964 400.3836 441.1927 441.7121 503.1488 549.1746 575.1267 580.1085 636.8653 652.8471 685.0654 699.3618 719.5537 734.4723 756.5297 834.3970 843.5592 859.2389 913.1751 922.9265 970.9115 981.5844 998.5762 1018.8016 1058.7453 1081.1207 1143.9875 1155.7272 1220.9276 1238.9738 1285.8007 1311.8817 1328.0926 1356.7787 1394.5961 1449.3767 1502.6449 1570.3939 1597.7166 1601.4684 1629.9905 1661.5525 3114.3561 3169.8240 3171.8147 3183.8659 3192.0387 3480.2488 3520.5394
redmass: 11.2494 9.4424 10.4456 8.1870 6.0129 10.7190 3.6683 5.9403 15.5404 3.5800 11.3376 9.5431 12.5456 5.3608 9.7031 8.7234 3.4890 6.7961 4.8475 3.6588 1.6472 5.9230 7.1472 2.0041 1.4458 8.1923 3.2038 5.4380 7.0996 5.8574 1.3755 1.3823 2.1692 5.4921 4.3135 1.3176 1.0881 4.2699 2.1834 2.3757 1.3970 1.9063 1.4743 1.4793 1.8264 1.7199 2.4805 4.6100 5.3681 2.5717 2.5620 7.0085 6.2488 4.3883 8.7234 6.1559 1.0925 1.0927 1.0907 1.0935 1.0962 1.0765 1.0641
irintensity: 0.2036 0.1090 0.0252 6.4608 4.4962 4.7379 0.0041 0.2420 1.9214 0.5567 0.0629 1.7170 1.2798 0.6924 11.3246 35.4213 13.0162 10.4893 19.7788 32.4308 55.2265 43.4807 10.2485 87.2364 27.5045 28.5800 4.0978 61.2411 56.4351 3.2869 53.5789 23.3226 2.4699 3.7976 3.6745 6.0143 63.3137 74.8636 418.3979 32.7016 14.5010 8.6428 42.9134 10.8976 0.0639 39.4058 205.0225 142.5806 9.1777 64.1460 470.3259 61.1500 82.7974 29.9212 219.2779 49.6512 1.7928 2.1391 1.7742 1.6730 11.0159 58.3789 65.8716
temp: 298.150 k
press: 1.00000 atm
elementType: 17 17 8 8 8 7 6 6 6 6 6 6 6 6 6 6 1 1 1 1 1 1 1
symmnumber: 1
zpe: 399552.8 jmol-1
zpe.correction: 0.152182 hartree
zpe.thermalcorrener: 0.167311 hartree
zpe.thermalcorrenthalpy: 0.168255 hartree
zpe.thermalcorrgfe: 0.107497 hartree
zpe.sumelectzpe: -1584.673448 hartree
zpe.sumelectthermal: -1584.658319 hartree
zpe.sumelectthermalent: -1584.657374 hartree
zpe.sumelectthermalfe: -1584.718133 hartree
dipole: 0.6489 0.8271 0.0001
dipole: 1.0513
quadrupole: -99.8636 -109.9753 -108.0606
quadrupole: -2.9271 -0.0014 -0.0002
quadrupole: 6.1029 -4.0088 -2.0941 -2.9271 -0.0014 -0.0002
hfenergy: -1584.8256297 hartree
pointgroup: C01 [X(C10H7Cl2N1O3)]
dipole: 0.2536859 -0.3266695 -0.00008 debye
dipolederiv: -0.2044951 0.1941395 0.0000358 0.1020009 -0.6672441 -0.0001255 0.000017 -0.0001169 -0.0442091 -1.0322943 0.127015 -0.0000026 0.1493129 -0.1403253 -0.0000124 0.0000145 -0.0000155 -0.0529353 -0.6762348 0.0719759 -0.0000123 -0.4544285 -0.8547591 -0.0000855 -0.0001895 -0.0001619 -0.3435197 -1.2943575 -0.5724912 -0.000267 -0.5751017 -0.6031531 -0.0001402 -0.0003422 -0.0001784 -0.4293469 -0.8978044 0.1387288 -0.0000348 0.2893274 -0.8939888 -0.0001558 -0.0000433 -0.0001066 -0.326751 -1.5428637 -0.2823902 -0.0001371 -0.423972 -0.476264 -0.0000698 -0.000191 -0.0000618 -0.2924438 0.8243408 0.0864738 0.0000413 -0.213983 -0.2544494 -0.0000834 -0.0000335 -0.0000733 0.1095543 0.1958052 -0.2750025 -0.0000511 -0.088709 0.990801 0.0002268 -0.000008 0.0002043 -0.0995408 -0.0735346 -0.1062468 -0.0000268 -0.0458256 -0.0195459 0.0000153 -0.0000164 0.0000212 -0.1378011 -0.4222166 0.0963853 0.0000065 0.2936735 -0.2086533 -0.0000215 0.0000517 -0.0000299 -0.0428972 -0.3821416 0.0269192 -0.000003 -0.1103354 0.0509781 0.0000215 -0.0000203 0.0000318 -0.0996382 1.3673718 -0.189604 -0.0000056 -0.2576803 0.1562048 0.0000378 -0.0000284 0.0000437 -0.080996 1.5479779 0.2005031 0.0001522 0.789831 1.0721644 0.0001758 0.0004299 0.0002466 0.242509 0.1265125 0.0776676 0.0000329 0.1651307 0.0412745 0.0000578 0.0000442 0.0000445 -0.142665 -0.975357 0.0089449 -0.0000866 0.1186566 0.0405333 0.0000393 -0.000118 0.0000213 -0.0864227 2.3972491 0.265707 0.0003697 -0.1513155 1.2236427 0.000301 0.0003732 0.0003198 0.2494749 0.1624042 -0.0280884 -0.0000002 -0.0090582 0.0839013 -0.0000202 0.0000021 -0.0000216 0.1840914 0.2215799 0.0286948 0.0000081 0.1670364 0.2114247 -0.0000079 0.0000519 -0.0000091 0.3036727 0.0715179 -0.0382119 -0.0000094 -0.041083 0.0553442 -0.0000235 -0.0000104 -0.0000234 0.1726876 0.0658229 0.0438643 0.0000056 0.0554716 -0.0026841 -0.0000304 0.0000081 -0.000031 0.1651482 0.0644578 -0.0126704 -0.0000162 0.0172995 -0.03544 -0.0000465 -0.0000208 -0.0000435 0.1719967 0.1285394 0.0255743 -0.0000045 0.0572665 0.0359301 -0.0000248 -0.000003 -0.0000285 0.1745223 0.32772 0.1121121 0.0000053 0.1664853 0.1943081 -0.0000278 0.000032 -0.0000317 0.4055096 unknown
polarizability: 315.8508366|-1.1118421|149.8996737|0.0174606|0.0208754|54.0074743 unknown
InChI: InChI=1S/C10H7Cl2NO3/c11-6-1-2-8(7(12)5-6)13-9(14)3-4-10(15)16/h1-5,13,15H
charge 0 multiplicity 1
23 atoms
Cl -1.671466 -2.887463 -0.000749
Cl -5.93035 0.67788 -0.000117
O  0.990062 1.764388 0.000362
O  5.958192 0.771996 0.00086
O  5.111997 -1.400501 0.000115
N  0.036154 -0.393289 -0.000237
C  -1.343046 -0.091773 -0.000204
C  -2.28431 -1.160352 -0.000426
C  -1.857215 1.236116 0.000044
C  -3.671067 -0.95034 -0.000401
C  -3.246569 1.4703 0.00007
C  -4.136707 0.379754 -0.00015
C  1.114984 0.501019 -0.000024
C  2.439932 -0.186586 0.000007
C  3.599319 0.526752 0.000338
C  4.911608 -0.160556 0.000367
H  -1.148092 2.065797 0.000206
H  0.26017 -1.394468 -0.000428
H  -4.363546 -1.795327 -0.000574
H  -3.626911 2.495281 0.000259
H  2.489182 -1.28459 -0.000226
H  3.582642 1.621309 0.000587
H  6.829439 0.290053 0.00092
