program: Gaussian 09
title: 000229912
version: EM64L-G09RevD.01
frameworkgroup: C1[X(C7H10N2O5)]
method: RPBEPBE
basis: SDD
operation: Freq
keyword: #p
keyword: freq=noraman
keyword: PBEPBE/SDD
title: #p freq=noraman PBEPBE/SDD
converged: YES YES NO NO
title: Mulliken charges:
elementType: O O O O O N N C C C C C C C H H H H H H H H H H
charge: -0.267389 -0.444827 -0.277785 -0.173183 -0.207406 -0.441229 -0.648982 -0.315898 -0.310787 0.297949 -0.308530 -0.245326 0.247593 0.295417 0.221676 0.251194 0.226856 0.200522 0.259202 0.286974 0.315799 0.372924 0.354422 0.310813
chargesum: 0.00000
title: Mulliken charges with hydrogens summed into heavy atoms:
elementType: O O O O O N N C C C C C C C
charge: -0.267389 -0.071903 -0.277785 -0.173183 -0.207406 -0.125430 0.016253 0.156971 0.116591 0.297949 -0.049328 0.041648 0.247593 0.295417
polarizability: 1.77086539e+02 1.18262036e+01 1.13862821e+02 1.69258180e+00 9.93483971e-01 6.09683361e+01
1716.lowfreq: -11.9466 -0.0005 0.0002 0.0004 1.4308 4.4814 10.0570 28.0664 42.3013
frequency: -4.0854 27.5885 42.2943 56.9697 92.9174 103.7090 122.3046 166.3914 177.4543 196.4256 219.0618 261.9062 322.5054 353.6990 370.7058 403.9362 455.6972 466.7869 530.4869 551.3525 611.8531 621.6848 629.5486 660.2497 694.2775 715.0135 739.4859 783.3074 870.2446 879.2170 902.7347 925.8570 992.6826 999.0595 1006.5354 1049.3389 1052.8875 1062.1192 1144.6970 1192.1171 1201.4963 1247.7707 1255.3543 1288.1038 1301.4501 1344.8989 1354.6035 1412.2117 1437.8706 1441.3552 1456.2325 1603.9360 1612.1679 1615.0881 1641.3300 1697.8723 2947.3502 3025.2744 3055.0602 3114.2699 3143.7451 3150.4978 3414.6781 3520.0003 3532.2826 3684.6268
redmass: 5.8174 6.2593 6.5356 6.0620 5.0153 4.0103 5.4244 2.6210 5.5387 5.1968 4.1909 10.1076 4.3444 1.4389 2.7236 3.3315 4.3004 3.4912 3.4335 1.1713 1.7564 1.6964 1.3903 3.4498 4.2139 8.2903 8.2004 3.5985 3.1954 3.6253 2.7054 2.9880 1.1990 3.9262 2.7540 3.0232 2.0225 2.7718 2.6391 1.0739 2.7011 1.1949 1.2971 1.8379 2.7581 1.2585 1.3173 1.1993 1.1074 2.1045 1.0780 7.7984 1.4265 3.5070 5.9269 6.1830 1.0691 1.0606 1.0934 1.1054 1.0972 1.0867 1.0658 1.0727 1.0496 1.1040
irintensity: 11.6610 1.0815 2.5160 2.1870 0.7270 7.4065 5.8737 5.7633 0.8389 2.4099 8.0857 11.4139 9.9882 43.9210 17.7413 3.2523 13.9267 28.9624 24.5698 247.6839 6.2232 53.3942 171.3769 18.2771 8.9406 5.4823 58.8819 14.9579 14.5743 27.9968 8.7409 19.5289 50.7290 11.8863 80.7827 77.6921 17.4715 5.0491 233.3965 30.5117 318.9705 84.7441 60.2347 141.6303 78.1146 29.0790 24.9458 163.3483 30.8323 652.4135 6.3687 153.8262 38.3481 65.0708 12.7922 366.0613 59.8839 19.3983 44.1209 19.9074 7.5442 1.5839 182.0650 6.8979 47.4129 39.5177
temp: 298.150 k
press: 1.00000 atm
elementType: 8 8 8 8 8 7 7 6 6 6 6 6 6 6 1 1 1 1 1 1 1 1 1 1
symmnumber: 1
zpe: 466272.2 jmol-1
zpe.correction: 0.177594 hartree
zpe.thermalcorrener: 0.191787 hartree
zpe.thermalcorrenthalpy: 0.192731 hartree
zpe.thermalcorrgfe: 0.134678 hartree
zpe.sumelectzpe: -757.290856 hartree
zpe.sumelectthermal: -757.276662 hartree
zpe.sumelectthermalent: -757.275718 hartree
zpe.sumelectthermalfe: -757.333771 hartree
dipole: 1.0536 8.5186 0.1080
dipole: 8.5842
quadrupole: -108.6288 -77.3907 -82.3412
quadrupole: -12.5102 11.9135 -0.1738
quadrupole: -19.1752 12.0628 7.1124 -12.5102 11.9135 -0.1738
hfenergy: -757.4684495 hartree
pointgroup: C01 [X(C7H10N2O5)]
dipole: 0.1377544 -3.3408998 0.4748481 debye
dipolederiv: -1.1184591 0.4724268 -0.0034131 0.6642342 -0.9717112 -0.1272925 0.0087163 -0.0887204 -0.3432586 -0.5189543 -0.0504925 -0.0258999 -0.0986169 -0.6877016 -0.044591 -0.0775041 -0.0123325 -0.6212483 -1.0163832 -0.1732386 -0.1145318 -0.145546 -0.7693588 -0.0975107 -0.1345285 -0.0833621 -0.3608847 -0.644244 0.203464 -0.0603819 -0.1928362 -0.7713093 0.2155819 0.183545 0.205627 -0.4119722 -0.9505435 0.2033181 -0.0680284 0.1409666 -0.6900722 0.0935768 -0.0998428 0.0666114 -0.3555249 -1.7412495 -0.5751078 0.2850901 -0.6950785 -0.7849281 0.1360477 0.2800039 0.1034552 -0.3765283 -0.5310024 -0.3148956 0.0635211 -0.4432846 -1.0503325 0.1431696 0.1012499 0.1534088 -0.8231362 0.7720542 -0.3099893 -0.0233833 -0.2616418 0.2736669 -0.0223058 -0.1062078 -0.0349648 0.2012292 0.2211576 0.0820661 -0.0184542 0.1545666 0.5488075 -0.0212675 0.0540541 -0.0280962 0.2946595 1.7533475 -0.275965 0.0192933 -0.4104665 1.3608976 0.2084795 0.0804301 0.1668405 0.3212773 -0.6643061 0.1825879 0.0072319 0.2889556 -0.0580471 0.049673 0.1234773 0.0184204 -0.159157 -0.1603297 0.0203193 0.0072031 -0.2107492 0.134206 0.0523303 -0.0323916 0.0330367 -0.107516 1.4705989 0.0164974 -0.0697146 0.9069122 1.1890821 -0.4867858 -0.4607162 -0.394015 0.4728268 2.2126308 0.3800506 -0.1069241 0.2723856 1.5623488 -0.3231056 0.0472771 -0.2803509 0.431225 0.0028539 0.0067628 -0.02692 0.0496227 -0.1107814 -0.0761063 -0.0125563 -0.0540045 0.0820947 -0.0557834 0.0569542 0.0214972 -0.0209529 0.036888 0.1162895 0.0371243 0.0480283 -0.0301238 -0.1026639 0.1379706 -0.0134912 0.0712466 -0.0101734 -0.0004983 -0.0214446 -0.0108117 0.0934241 -0.003215 -0.1185796 0.1346319 -0.0732577 -0.0382666 0.0454307 0.0825493 0.0635435 -0.1037525 0.0266479 -0.0547453 -0.0171744 -0.1091099 0.0039261 -0.0350396 -0.0261706 -0.021354 0.1595192 0.0648445 -0.0310069 -0.0160423 -0.0500962 0.0647976 -0.0117501 -0.0490286 0.0031859 0.1672765 0.127184 0.0169893 -0.0284675 0.0362962 0.1246077 0.0868224 -0.0804848 0.0701591 0.2726239 0.5040272 0.0379817 0.0556629 0.0380467 0.2754159 0.0133317 0.1185257 0.0217162 0.4035765 0.2101862 0.0351563 -0.0110526 0.0156363 0.2014994 0.042738 -0.0056635 0.0431885 0.3904962 0.1416012 0.0514756 0.0097477 0.0727669 0.1665387 0.0427821 -0.0104138 0.0107906 0.4028736 unknown
polarizability: 174.7395582|-16.6596374|115.2107722|2.6496509|-7.497544|61.9673665 unknown
InChI: InChI=1S/C7H10N2O5/c8-7(13)9-5(11)1-2-6(12)14-4-3-10/h1-2,9-10H,3-4,8H2
charge 0 multiplicity 1
24 atoms
O  2.390808 -0.760851 -0.53426
O  5.077786 0.845616 0.738701
O  2.527952 1.534446 -0.088185
O  -2.417281 2.641118 -0.900698
O  -4.846296 1.166549 -0.221078
N  -2.580566 0.487373 0.079209
N  -4.346963 -1.017653 0.421035
C  3.88754 -0.897419 -0.624329
C  4.645198 -0.540077 0.669257
C  1.847594 0.498579 -0.320638
C  0.367009 0.43403 -0.392354
C  -0.393419 1.553848 -0.229177
C  -1.886966 1.626346 -0.382429
C  -4.003772 0.285239 0.060427
H  3.996898 -1.963222 -0.880022
H  4.246648 -0.265464 -1.457374
H  5.576043 -1.13456 0.69385
H  4.028649 -0.838847 1.545963
H  -0.055886 -0.550049 -0.624079
H  0.099312 2.522449 -0.078119
H  -2.013093 -0.219588 0.553758
H  4.286256 1.420262 0.535096
H  -5.342216 -1.226606 0.468535
H  -3.682435 -1.784321 0.509413
