program: Gaussian 09
title: 000229909
version: EM64L-G09RevD.01
frameworkgroup: C1[X(C10H16Br2O6)]
method: RPBEPBE
basis: SDD
operation: Freq
keyword: #p
keyword: freq=noraman
keyword: PBEPBE/SDD
title: #p freq=noraman PBEPBE/SDD
converged: YES YES NO NO
title: Mulliken charges:
elementType: Br Br O O O O O O C C C C C C C C C C H H H H H H H H H H H H H H H H
charge: 0.000339 0.030508 -0.276141 -0.270590 -0.266511 -0.235747 -0.234550 -0.264769 -0.257183 -0.325412 -0.290681 -0.287035 -0.283758 -0.299804 0.369698 0.388527 -0.803596 -0.767700 0.210079 0.215424 0.228639 0.237577 0.229878 0.214685 0.229142 0.245908 0.227956 0.258172 0.250025 0.239391 0.360774 0.307499 0.312883 0.306375
chargesum: 0.00000
title: Mulliken charges with hydrogens summed into heavy atoms:
elementType: Br Br O O O O O O C C C C C C C C C C
charge: 0.000339 0.030508 -0.276141 -0.270590 -0.266511 -0.235747 -0.234550 -0.264769 0.168319 0.140804 0.153882 0.188015 0.202371 0.189612 0.369698 0.388527 -0.135323 -0.148443
polarizability: 1.92202455e+02 1.19556282e+01 1.41571821e+02 -8.31491376e+00 1.88248836e+00 1.39087373e+02
1716.lowfreq: -4.8489 -1.6574 -0.0008 -0.0004 0.0002 3.7977 9.0481 12.0108 18.3295
frequency: 7.7506 11.7606 18.2121 28.1968 42.2954 50.5237 55.4893 63.8949 69.9773 82.9644 110.0813 130.5750 141.0288 154.6979 175.6472 199.1954 226.5431 276.7784 286.4158 302.1962 313.5357 339.2531 360.9605 386.2906 442.4853 457.9728 478.2211 507.6168 542.0673 638.0403 641.6578 664.7290 722.4026 750.4171 777.3839 800.0588 814.4786 831.5047 876.3072 898.6069 898.9958 904.3318 948.0788 955.8829 1005.9461 1027.9703 1050.5164 1058.1909 1066.6251 1073.4546 1088.7183 1095.6894 1123.5715 1147.1115 1195.3693 1197.3662 1218.8614 1222.7169 1229.8053 1244.5184 1272.4019 1274.4336 1279.8021 1284.1196 1323.6476 1329.3587 1348.6151 1358.4800 1378.5319 1383.7508 1425.4288 1429.9620 1430.9448 1440.5863 1456.9858 1467.7962 1482.5497 1488.3531 1623.7632 1653.1191 2968.2510 2977.1481 2989.7798 3006.6943 3029.5114 3034.6200 3034.9201 3047.2090 3058.6742 3059.6098 3085.6776 3099.2210 3109.9985 3135.0969 3151.5993 3182.1055
redmass: 7.8901 14.1216 13.4000 6.3363 5.7583 5.9356 7.2653 4.9233 7.1783 5.8051 2.9724 3.8895 3.0962 5.7864 4.6050 3.3362 4.6877 3.3665 3.4197 4.5616 3.3528 3.5964 3.3909 5.1714 2.1976 3.9364 3.7368 7.3126 3.4470 5.9007 4.8799 4.8076 6.7626 3.5746 2.0009 1.1636 1.9012 3.6473 4.0494 1.9414 1.8184 3.2843 6.4745 3.3466 2.8123 3.9640 2.9418 3.7827 3.8344 3.2168 1.4540 2.2235 2.0171 1.7849 1.4132 1.2043 1.3907 1.1172 1.2568 1.8477 1.3403 1.1098 1.1227 1.1052 1.2409 1.2202 1.2424 1.2292 1.2841 1.2966 1.1016 1.0904 1.1172 1.0871 1.0971 1.0783 1.0837 1.0820 9.1524 9.8365 1.0572 1.0618 1.0577 1.0618 1.0592 1.0729 1.0925 1.0605 1.1056 1.0995 1.0557 1.1049 1.1082 1.1088 1.1029 1.1126
irintensity: 0.8856 0.2839 1.4742 1.3318 2.0437 0.2079 1.0311 0.0988 0.2042 0.9363 2.4101 7.0545 0.1899 1.5676 14.1786 6.1464 12.8479 5.5355 21.0174 0.9151 14.6964 15.4234 17.1961 3.6083 7.3010 1.9032 23.6944 25.1327 7.3637 7.2845 16.3793 14.2331 1.7642 0.8335 5.6809 7.1735 1.8294 14.4735 5.1777 20.1209 0.7625 42.6925 76.6391 19.9047 16.6332 117.0950 16.8550 3.0663 31.8860 15.7228 111.9182 262.6999 65.5185 10.3343 95.1401 11.8628 54.7918 0.9679 22.9833 105.2031 33.4027 5.8071 23.6757 11.4580 4.3911 2.9656 2.3622 7.7990 10.0589 0.5843 42.4813 18.0538 12.9178 12.6135 10.4019 6.9412 6.4460 6.7152 197.8353 175.6798 34.7429 49.4647 21.5333 43.4047 26.0381 41.5846 54.5261 19.5015 23.8362 33.6801 3.1653 32.1038 11.7436 12.0002 11.5477 0.1502
temp: 298.150 k
press: 1.00000 atm
elementType: 35 35 8 8 8 8 8 8 6 6 6 6 6 6 6 6 6 6 1 1 1 1 1 1 1 1 1 1 1 1 1 1 1 1
symmnumber: 1
zpe: 679088.2 jmol-1
zpe.correction: 0.258651 hartree
zpe.thermalcorrener: 0.280045 hartree
zpe.thermalcorrenthalpy: 0.280989 hartree
zpe.thermalcorrgfe: 0.199950 hartree
zpe.sumelectzpe: -867.442309 hartree
zpe.sumelectthermal: -867.420915 hartree
zpe.sumelectthermalent: -867.419971 hartree
zpe.sumelectthermalfe: -867.501010 hartree
dipole: -1.2828 0.8065 1.6817
dipole: 2.2637
quadrupole: -122.1834 -132.3828 -123.9222
quadrupole: -5.5506 -13.7169 0.5116
quadrupole: 3.9794 -6.2200 2.2406 -5.5506 -13.7169 0.5116
hfenergy: -867.7009603 hartree
pointgroup: C01 [X(C10H16Br2O6)]
dipole: -0.7432376 0.0608307 -0.4868986 debye
polarizability: 159.6983153|-26.1461994|176.8122702|4.1483248|-0.8633448|136.3510641 unknown
InChI: InChI=1S/C10H16Br2O6/c11-7-9(13)17-5-3-15-1-2-16-4-6-18-10(14)8-12/h1-8H2
charge 0 multiplicity 1
34 atoms
Br -1.179779 -2.791676 1.699596
Br 3.825051 -3.519714 -1.551682
O  -1.713098 3.406872 -0.581447
O  1.696584 2.959037 0.869124
O  -2.981324 0.2201 -0.421252
O  3.163442 -0.414743 0.135869
O  -1.518624 0.431639 1.392906
O  1.195586 -1.181908 -0.854455
C  -0.356011 2.831602 -0.561501
C  0.263821 3.284837 0.772208
C  -2.759208 2.615941 -1.226821
C  1.990775 1.540826 1.123836
C  -3.466775 1.629779 -0.276306
C  2.74241 1.002572 -0.107002
C  -2.02996 -0.254493 0.484137
C  2.290293 -1.404387 -0.28206
C  -1.704191 -1.689924 0.105673
C  2.836783 -2.776151 0.052151
H  -0.383461 1.726595 -0.624496
H  0.226357 3.229448 -1.417118
H  -0.303981 2.83787 1.610652
H  0.218873 4.383811 0.843594
H  -3.501425 3.364867 -1.557852
H  -2.387592 2.076741 -2.122798
H  2.639833 1.486085 2.016804
H  1.067102 0.96053 1.314235
H  -4.536175 1.544239 -0.530316
H  -3.340679 1.957984 0.770398
H  3.68522 1.547309 -0.262531
H  2.113572 1.044818 -1.012071
H  -0.821789 -1.702686 -0.556858
H  -2.565332 -2.183504 -0.361995
H  2.01862 -3.48062 0.251358
H  3.571183 -2.737501 0.866322
