program: Gaussian 09
title: 000229908
version: EM64L-G09RevD.01
frameworkgroup: C1[X(C5H8BrClO3)]
method: RPBEPBE
basis: SDD
operation: Freq
keyword: #p
keyword: freq=noraman
keyword: PBEPBE/SDD
title: #p freq=noraman PBEPBE/SDD
converged: YES YES NO NO
title: Mulliken charges:
elementType: Br Cl O O O C C C C C H H H H H H H H
charge: 0.018808 -0.075021 -0.243154 -0.421875 -0.212391 -0.094292 -0.311739 -0.583298 0.350841 -0.760305 0.273600 0.269553 0.241039 0.294123 0.295824 0.342647 0.307257 0.308382
chargesum: 0.00000
title: Mulliken charges with hydrogens summed into heavy atoms:
elementType: Br Cl O O O C C C C C
charge: 0.018808 -0.075021 -0.243154 -0.079228 -0.212391 0.179308 0.198852 0.006649 0.350841 -0.144666
polarizability: 9.84683893e+01 -1.84028385e+00 8.85487229e+01 -7.92408268e+00 1.76555592e+00 6.94813929e+01
1716.lowfreq: -10.4003 -6.0362 -0.0024 -0.0019 -0.0016 11.0578 19.5213 36.3430 51.2602
frequency: 17.8072 36.3416 51.1882 63.6958 115.0994 147.9074 188.5496 257.0728 286.7397 319.9544 397.1680 431.5180 446.1593 512.7180 527.5319 643.9886 661.6074 721.6095 782.3299 829.9807 882.8341 896.0319 959.8731 987.3246 1041.1631 1083.4494 1097.2577 1183.1646 1213.5506 1216.7353 1230.0175 1242.6210 1288.3513 1327.8658 1363.7068 1380.7573 1425.4632 1428.9144 1447.3134 1640.3889 3034.6751 3050.4735 3069.8321 3087.2824 3133.2212 3159.0015 3185.6629 3492.9913
redmass: 11.0981 9.7403 5.2489 8.1471 5.6142 7.1486 8.0237 4.6850 2.6485 4.0124 2.5991 1.1411 4.5344 4.1475 5.5131 4.8944 4.1225 7.0351 3.7774 2.9444 1.9753 1.8059 6.2878 2.1894 1.6320 1.4599 1.8481 1.4558 1.4891 1.5126 1.4356 1.2837 1.2512 1.3170 1.2634 1.2589 1.1134 1.1083 1.0933 9.9292 1.0828 1.0576 1.0575 1.0558 1.1098 1.1122 1.1124 1.0654
irintensity: 1.1242 0.4276 1.2281 2.2390 1.1342 0.1675 8.2142 11.3173 12.7867 3.2785 15.7399 133.9754 9.3138 17.5010 30.2904 12.2750 20.8718 0.1363 12.1943 12.5966 5.6788 4.3740 107.6174 45.4012 16.6695 114.1879 50.8395 46.6502 83.4264 47.3000 57.2585 31.8295 16.8723 4.1415 11.3067 17.5184 19.0070 19.2648 24.0870 181.9682 1.3463 17.8475 9.0583 5.1315 2.4158 2.6328 0.1853 18.6844
temp: 298.150 k
press: 1.00000 atm
elementType: 35 17 8 8 8 6 6 6 6 6 1 1 1 1 1 1 1 1
symmnumber: 1
zpe: 340869.3 jmol-1
zpe.correction: 0.129830 hartree
zpe.thermalcorrener: 0.141530 hartree
zpe.thermalcorrenthalpy: 0.142475 hartree
zpe.thermalcorrgfe: 0.087950 hartree
zpe.sumelectzpe: -893.712749 hartree
zpe.sumelectthermal: -893.701049 hartree
zpe.sumelectthermalent: -893.700104 hartree
zpe.sumelectthermalfe: -893.754629 hartree
dipole: 0.6878 -0.5455 1.6308
dipole: 1.8521
quadrupole: -76.1813 -82.8052 -75.3697
quadrupole: 1.3450 1.7187 8.9807
quadrupole: 1.9374 -4.6865 2.7490 1.3450 1.7187 8.9807
hfenergy: -893.8425791 hartree
pointgroup: C01 [X(C5H8Br1Cl1O3)]
dipole: -0.3119053 -0.6141339 -0.2377404 debye
dipolederiv: -0.1629738 -0.0165367 -0.0200699 -0.0624577 -0.148433 0.0854444 0.0835289 0.1161662 -0.3179893 -0.3578221 0.169613 0.056974 0.1782777 -0.4012337 -0.0190133 0.1076634 -0.0872719 -0.245588 -1.4059766 0.1127408 0.3941886 0.21097 -0.5395338 -0.0793474 0.343793 -0.0614656 -0.446918 -0.7555978 -0.2172745 -0.0066654 -0.2553963 -0.3605799 0.1541593 -0.1040041 0.1567198 -0.524493 -0.6042645 -0.0458568 0.1721285 0.374388 -0.8554777 0.0368372 0.0802554 0.0569496 -0.3245267 0.5121925 0.2157902 -0.002327 0.2078813 0.2069217 -0.0613578 0.1756657 -0.1720308 0.2113559 0.6275121 0.0221282 -0.1303386 0.1767707 0.176802 -0.0512865 -0.2298591 0.0037806 0.2425822 0.3317192 -0.257175 -0.1460173 -0.3497564 0.3481033 0.2056513 -0.1655162 0.2248924 0.1771296 1.3835206 -0.0898128 -0.6974505 -0.6416027 1.1542243 -0.0281545 -0.5365263 -0.0469904 0.3844354 -0.0103319 -0.0848028 0.1906888 -0.0696267 0.0241208 -0.0297427 0.1357708 -0.050208 0.4312233 0.0425238 0.0220915 0.0541958 0.0708185 0.008154 -0.0577801 0.011952 0.0246296 0.0107306 -0.0002252 0.0455854 -0.0415959 -0.0278138 0.01111 0.1013389 -0.010453 0.0415504 0.049772 0.0009978 0.0141793 0.0910334 0.0020731 0.0387829 -0.0870905 0.0511596 -0.0443459 0.046909 -0.0196732 0.0487354 -0.0400803 0.0440506 0.0340692 -0.0835307 -0.0414763 -0.0596008 -0.02752 0.0207478 -0.0287688 0.0809265 -0.0208648 -0.0017849 -0.001771 0.091514 -0.0097239 0.0620332 0.2908604 0.066259 0.040678 0.1163375 0.2176555 -0.1221968 0.0599903 -0.0958824 0.3158463 0.1096844 -0.0002923 0.0040179 -0.0252245 0.0226139 -0.008546 -0.0251299 -0.0540514 -0.0422432 -0.0028934 0.023397 -0.0002865 0.0711753 0.0644854 0.0463863 -0.0283282 0.0568827 -0.0027393 unknown
polarizability: 92.8309812|-5.3298975|77.5856485|-10.864527|-9.0290949|86.0818755 unknown
InChI: InChI=1S/C5H8BrClO3/c6-1-5(9)10-3-4(8)2-7/h4,8H,1-3H2
charge 0 multiplicity 1
18 atoms
Br -2.193365 -1.181199 2.416653
Cl 3.260237 -1.653093 0.168091
O  -0.427011 -0.516574 -0.456762
O  2.789413 1.433208 -0.240687
O  -1.567845 1.490684 -0.071852
C  1.654711 0.657753 0.263258
C  0.768972 0.240335 -0.931145
C  2.096767 -0.507935 1.150215
C  -1.514469 0.242671 -0.023622
C  -2.608801 -0.664967 0.499292
H  1.088425 1.365478 0.897115
H  0.450154 1.141623 -1.479847
H  1.292441 -0.467458 -1.592643
H  2.698462 -0.161808 2.002285
H  1.255404 -1.139897 1.469019
H  3.467578 0.791539 -0.585997
H  -2.665205 -1.611595 -0.053967
H  -3.567768 -0.133567 0.536392
