program: Gaussian 09
title: 000021855
version: EM64L-G09RevD.01
frameworkgroup: C1[X(C20H24N2)]
method: RPBEPBE
basis: SDD
operation: Freq
keyword: #pfreq=noraman
keyword: PBEPBE/SDD
title: #p freq=noraman PBEPBE/SDD
converged: YES YES NO NO
title: Mulliken charges:
elementType: N N C C C C C C C C C C C C C C C C C C C C H H H H H H H H H H H H H H H H H H H H H H H H
charge: -0.071690 -0.050188 0.234123 0.233669 -0.697844 -0.300018 0.129366 0.259002 -0.583493 -0.364576 -0.729342 -0.389111 0.180688 -0.429660 -0.275581 -0.239752 -0.323136 -0.623153 -0.615644 -0.187665 -0.374094 -0.182673 0.241530 0.237086 0.214146 0.227404 0.218137 0.220339 0.185166 0.212005 0.245461 0.224233 0.276988 0.237680 0.221512 0.221002 0.236062 0.221467 0.186196 0.238012 0.223965 0.187735 0.223450 0.234343 0.237314 0.229539
chargesum: 0.00000
title: Mulliken charges with hydrogens summed into heavy atoms:
elementType: N N C C C C C C C C C C C C C C C C C C C C
charge: -0.071690 -0.050188 0.234123 0.233669 -0.219228 -0.085872 0.129366 0.259002 -0.137951 0.040929 -0.047643 -0.112123 0.180688 -0.191980 -0.054069 -0.018750 -0.087074 0.022521 0.019506 0.046678 -0.136781 0.046867
polarizability: 2.89124987e+02 8.78919142e-01 2.26868753e+02 4.93426113e+00 -3.57343876e-01 1.69319350e+02
1716.lowfreq: -12.4142 -4.0285 -0.0007 -0.0005 0.0006 9.4004 10.6859 12.4857 24.2655
frequency: -6.4567 11.3614 24.1786 47.8426 52.3930 58.6664 98.8663 117.1803 149.6711 153.2698 188.1974 197.7349 207.6698 218.0352 231.9631 244.5713 253.3483 258.2872 290.1207 327.7972 349.2627 399.2543 404.4407 423.3739 431.8099 445.6506 466.1275 494.7891 507.3974 539.1368 578.8666 614.5339 625.1787 645.7806 665.9614 698.6486 735.9611 748.0763 773.0013 780.9668 787.0251 801.7622 820.1397 829.1835 874.8325 889.8183 897.2953 918.9201 954.4943 955.8703 959.6588 965.5483 989.2273 997.6860 1012.2055 1017.5167 1026.1296 1034.0060 1040.9229 1042.1668 1055.0193 1072.7902 1082.2057 1089.9870 1103.7889 1113.1123 1121.0778 1135.0493 1163.4525 1165.3106 1170.9885 1176.4350 1208.1336 1214.6884 1221.6861 1250.2105 1264.8203 1279.9095 1288.5949 1290.0472 1300.6965 1302.0444 1315.5488 1335.2527 1341.8904 1362.4551 1389.6309 1399.0790 1410.1979 1418.0486 1418.9032 1439.7026 1449.5871 1453.3226 1457.4701 1461.3716 1464.7589 1467.8576 1473.1386 1474.2647 1475.8275 1479.0959 1486.7917 1561.0242 1581.3431 1585.9313 1614.4120 1618.7609 2824.2479 2843.4827 2860.5171 2966.0112 2969.1672 2987.1273 2997.3960 3007.7827 3009.8792 3017.4643 3030.3529 3048.2306 3076.1994 3087.3252 3088.1539 3116.0220 3116.4140 3122.9516 3127.6267 3130.0897 3145.0272 3147.3341 3158.3469 3168.2097
redmass: 2.6380 4.0064 4.2725 3.9033 4.9488 3.9675 2.2944 3.6649 3.6198 3.2648 1.4518 1.9725 2.5243 2.5722 1.5618 2.1958 1.2680 1.9684 3.2498 2.6103 2.8960 3.4225 3.5529 2.9702 2.4220 3.1565 3.3428 3.4941 3.3462 4.3963 4.8838 6.5692 3.6936 4.6850 4.0124 4.4602 1.8160 1.6243 1.9080 1.4901 2.2980 3.2741 3.6078 3.4788 1.3603 2.4448 1.4863 1.9279 1.7320 1.4856 2.5143 3.0708 1.3082 1.3439 2.7699 2.2446 2.0748 1.6406 1.9266 2.2061 2.4566 2.2143 2.2386 1.2966 1.7578 1.2368 1.5285 1.5201 1.0876 1.5845 1.1633 1.5534 2.3684 2.4291 1.9409 2.0526 2.3094 2.1828 1.5229 1.3304 1.9788 1.6608 1.5348 1.9980 3.2960 1.3474 1.2011 3.6437 1.9425 1.1444 1.2148 1.1571 2.4999 1.9771 1.0956 1.0630 1.2736 1.8982 1.0901 1.0777 1.0737 1.0651 1.0581 5.9021 5.7056 6.4981 8.1612 7.0271 1.0698 1.0573 1.0576 1.0621 1.0630 1.0788 1.0392 1.0977 1.0855 1.0722 1.0719 1.0964 1.1010 1.1004 1.1005 1.0887 1.0954 1.0877 1.0897 1.0891 1.0943 1.0946 1.1000 1.1013
irintensity: 0.7970 0.8315 0.9192 0.4115 0.2088 0.4065 1.1306 0.3171 1.3411 0.9495 0.8925 0.3021 3.3450 2.9071 0.5232 2.2709 2.0975 3.8286 0.0191 9.2202 2.2725 2.4832 2.9427 9.4813 1.2073 0.4654 2.4439 4.2923 0.4142 6.8675 8.1356 0.7245 0.0640 2.5633 2.4037 1.8435 37.5389 32.2971 52.9138 10.0961 9.0510 11.4687 7.0947 15.5657 1.9079 1.8780 1.2597 1.2459 1.9977 5.7566 0.1845 9.0542 0.9696 0.1693 7.1021 5.0001 12.7460 31.2162 8.2204 4.7953 55.4485 16.5994 2.0978 6.0194 4.5781 10.4430 2.4437 8.2828 1.4506 8.1613 1.8162 3.9800 3.2646 1.0471 4.6133 1.9127 10.1275 1.0068 11.1574 1.3885 3.2825 5.0880 2.4326 1.5017 5.6364 10.8888 17.9634 6.5617 23.0495 5.6573 10.4047 3.4639 8.3715 30.7487 5.5468 18.9553 1.6809 32.9045 20.1668 1.8066 7.0629 18.2571 23.0409 12.7031 41.6850 0.8021 13.1892 1.9574 69.3044 71.6323 233.0961 11.2985 38.4185 18.4716 31.1757 9.8598 37.0013 42.9584 41.5509 38.6809 37.1962 49.5365 36.0102 7.8046 16.1131 18.2700 19.3451 2.8021 16.0802 27.0704 34.8776 27.2251
temp: 298.150 k
press: 1.00000 atm
elementType: 7 7 6 6 6 6 6 6 6 6 6 6 6 6 6 6 6 6 6 6 6 6 1 1 1 1 1 1 1 1 1 1 1 1 1 1 1 1 1 1 1 1 1 1 1 1
symmnumber: 1
zpe: 1018768.9 jmol-1
zpe.correction: 0.388029 hartree
zpe.thermalcorrener: 0.408342 hartree
zpe.thermalcorrenthalpy: 0.409286 hartree
zpe.thermalcorrgfe: 0.337308 hartree
zpe.sumelectzpe: -884.397811 hartree
zpe.sumelectthermal: -884.377497 hartree
zpe.sumelectthermalent: -884.376553 hartree
zpe.sumelectthermalfe: -884.448531 hartree
dipole: 2.6533 -0.5922 -1.9455
dipole: 3.3430
quadrupole: -120.5793 -124.8988 -131.8351
quadrupole: 6.6346 2.3700 4.7564
quadrupole: 5.1918 0.8723 -6.0640 6.6346 2.3700 4.7564
hfenergy: -884.7858394 hartree
pointgroup: C01 [X(C20H24N2)]
dipole: 1.0113042 0.3297674 0.7735418 debye
polarizability: 288.3605053|6.8868757|227.5756495|-5.1697803|1.2064536|169.3769357 unknown
InChI: InChI=1S/C20H24N2/c1-15(19-10-6-7-12-21-19)20-17(11-13-22(2)3)14-16-8-4-5-9-18(16)20/h4-10,12,15H,11,13-14H2,1-3H3
charge 0 multiplicity 1
46 atoms
N  4.482711 1.162905 0.125857
N  -2.697023 1.726947 -0.626365
C  -0.029808 -0.498005 -0.695165
C  1.277404 -0.898502 -0.491966
C  1.308942 -2.284909 0.150169
C  -0.491166 0.801752 -1.34909
C  -0.944651 -1.563487 -0.211551
C  -0.158637 -2.643819 0.293524
C  2.549507 -0.159243 -0.827096
C  3.364805 0.24134 0.434603
C  -1.182214 0.544343 -2.711776
C  -2.35774 -1.640858 -0.184628
C  -1.35354 1.633657 -0.385355
C  -0.763774 -3.796847 0.818673
C  -2.964148 -2.805506 0.343747
C  -2.180467 -3.876154 0.840089
C  -0.748936 2.287043 0.721868
C  5.534202 0.549072 -0.710629
C  5.04654 1.770348 1.349599
C  -1.544292 3.054848 1.59646
C  -3.458473 2.473679 0.227264
C  -2.933733 3.155132 1.346424
H  1.828568 -2.275091 1.130436
H  1.859829 -3.010537 -0.483208
H  0.415296 1.40779 -1.545719
H  2.341176 0.768232 -1.391334
H  3.180598 -0.796111 -1.4801
H  2.686039 0.761573 1.138073
H  3.726309 -0.685294 0.955289
H  -0.483876 0.022367 -3.39031
H  -2.087032 -0.071581 -2.596043
H  -1.48957 1.497568 -3.176293
H  -2.972868 -0.81396 -0.553942
H  -0.158227 -4.62503 1.206158
H  -4.057511 -2.879956 0.370187
H  -2.671903 -4.768932 1.243473
H  0.329859 2.184868 0.885355
H  6.323047 1.295284 -0.912663
H  6.01431 -0.341729 -0.228364
H  5.11822 0.231206 -1.68126
H  4.248525 2.289391 1.910248
H  5.524613 1.026402 2.037476
H  5.811868 2.518036 1.073979
H  -1.093448 3.567551 2.453213
H  -4.528871 2.51954 -0.006531
H  -3.590459 3.741476 1.996824
