program: Gaussian 09
title: 000229904
version: EM64L-G09RevD.01
frameworkgroup: C1[X(C15H22O)]
method: RPBEPBE
basis: SDD
operation: Freq
keyword: #pfreq=noraman
keyword: PBEPBE/SDD
title: #p freq=noraman PBEPBE/SDD
converged: YES YES NO NO
title: Mulliken charges:
elementType: O C C C C C C C C C C C C C C C H H H H H H H H H H H H H H H H H H H H H H
charge: -0.232160 0.204267 -0.441601 -0.452496 0.258913 -0.507331 0.206750 -0.764033 -0.745868 -0.319846 -0.839176 -0.336619 0.427283 -0.826749 -0.377808 -0.135594 0.203769 0.200838 0.208733 0.209351 0.222179 0.221161 0.222880 0.226525 0.205113 0.225273 0.213369 0.228220 0.226526 0.259062 0.228079 0.228729 0.245747 0.233750 0.230821 0.238230 0.244075 0.159636
chargesum: 0.00000
title: Mulliken charges with hydrogens summed into heavy atoms:
elementType: O C C C C C C C C C C C C C C C
charge: -0.232160 0.204267 -0.036995 -0.034412 0.258913 -0.063991 0.206750 -0.109514 -0.079006 -0.093320 -0.123306 -0.090872 0.427283 -0.123947 -0.133733 0.024042
polarizability: 3.24587072e+02 -2.66107174e+00 1.67160785e+02 1.55193016e+01 6.32178743e+00 1.15386343e+02
1716.lowfreq: -7.6491 -4.3981 -0.0003 0.0003 0.0008 7.1716 31.4266 40.8166 55.1750
frequency: 31.3314 40.6310 55.1536 90.6131 111.8750 131.0704 140.4680 172.8472 176.2579 195.8149 216.8375 229.1650 250.4483 254.3493 284.4283 288.8665 302.4789 321.2089 356.0710 367.0142 394.1369 407.4220 428.1200 463.7153 474.6108 505.4582 537.2704 568.2058 592.0063 650.8163 722.0409 788.7606 840.3020 848.3903 864.1400 880.5945 898.0259 912.3416 922.8773 939.3778 956.8466 973.6702 982.2261 988.2341 1002.2993 1015.0766 1030.4506 1040.8449 1045.0444 1083.3047 1122.9360 1125.4465 1159.8020 1180.5917 1195.7972 1198.3873 1211.5197 1228.4348 1262.4999 1275.1897 1312.7763 1324.4765 1339.2376 1342.5153 1352.8556 1355.4080 1371.1456 1388.7006 1389.5632 1395.9576 1401.7683 1444.6204 1456.5339 1462.8731 1466.2222 1468.7155 1469.9659 1472.1417 1474.5087 1475.8530 1484.2461 1489.0760 1552.1896 1589.8367 1611.0916 1624.0586 2891.1832 2938.1034 2959.1994 2965.0589 2970.1511 2974.2704 2983.0941 2985.3831 2997.9202 3027.7945 3028.9105 3048.6259 3058.8317 3062.7172 3067.8911 3073.4141 3077.1115 3091.0880 3109.3962 3110.9190 3115.9648 3127.1060
redmass: 4.2032 2.9884 3.9107 3.2643 2.2582 2.0800 1.3557 2.3354 2.3098 2.7724 1.4710 1.4444 1.5310 1.5509 2.5597 1.7301 2.4041 2.7731 2.4165 1.9444 2.6522 3.0037 3.5653 3.0743 3.5787 2.8098 2.9496 2.5264 3.6674 3.8774 2.8531 2.5879 1.6614 2.2141 1.8444 2.2046 1.9541 1.5286 1.5239 1.9871 1.8352 1.2736 1.3001 1.6063 1.3500 1.6819 1.8739 1.5338 1.6304 1.6063 2.0002 2.4967 2.3055 2.6029 2.3331 2.1559 2.0597 1.4743 1.7681 1.4270 1.6801 1.4904 1.4402 1.5986 1.5118 1.9174 1.1867 1.7001 1.2170 1.2143 1.2214 1.1051 1.0685 1.0565 1.0857 1.1280 1.0767 1.0527 1.0584 1.0764 1.0622 1.0587 6.1055 4.6765 4.9860 5.5019 1.0838 1.0632 1.0403 1.0596 1.0351 1.0372 1.0794 1.0398 1.0769 1.0952 1.0980 1.1030 1.0968 1.0992 1.0986 1.0999 1.0993 1.0967 1.0885 1.0893 1.0955 1.0873
irintensity: 2.3370 0.7576 1.5851 0.8072 2.0875 0.2417 2.0741 4.8927 6.7090 0.2600 0.4622 0.1783 0.0471 0.2777 0.0977 4.1415 2.3336 0.4827 0.6092 1.9245 3.9407 6.6183 5.4248 2.4592 3.8267 1.5820 2.7271 1.9280 12.6535 2.8069 1.6527 7.1147 5.0533 4.9525 6.4422 3.4222 8.6218 10.7887 0.8093 2.2626 0.5306 27.9205 20.9868 20.1383 2.4498 10.1271 6.5296 0.8487 7.2871 2.5225 18.6703 26.1921 109.7108 13.8770 3.1899 9.4132 3.8092 107.3981 26.8337 10.4310 4.1864 4.2803 2.7282 2.6754 62.3628 7.1744 20.6296 13.8571 22.1073 12.9880 30.9426 25.7709 4.9452 5.5345 35.5156 28.2688 7.5098 16.7614 5.2036 21.9507 15.1410 10.1860 281.2163 352.3301 147.3955 3.9626 146.8960 32.6125 40.0649 33.2262 24.7601 38.3249 16.0675 16.8293 53.2512 26.2548 57.8536 57.3266 14.7285 8.5083 93.0478 25.7956 38.5126 15.4972 18.5942 1.7405 21.4477 20.4921
temp: 298.150 k
press: 1.00000 atm
elementType: 8 6 6 6 6 6 6 6 6 6 6 6 6 6 6 6 1 1 1 1 1 1 1 1 1 1 1 1 1 1 1 1 1 1 1 1 1 1
symmnumber: 1
zpe: 860800.6 jmol-1
zpe.correction: 0.327862 hartree
zpe.thermalcorrener: 0.345853 hartree
zpe.thermalcorrenthalpy: 0.346797 hartree
zpe.thermalcorrgfe: 0.282224 hartree
zpe.sumelectzpe: -658.744044 hartree
zpe.sumelectthermal: -658.726053 hartree
zpe.sumelectthermalent: -658.725108 hartree
zpe.sumelectthermalfe: -658.789682 hartree
dipole: -6.4556 -1.5457 -1.4343
dipole: 6.7912
quadrupole: -133.4359 -92.9576 -100.2880
quadrupole: -13.0733 -7.9733 0.5454
quadrupole: -24.5421 15.9362 8.6058 -13.0733 -7.9733 0.5454
hfenergy: -659.0719053 hartree
pointgroup: C01 [X(C15H22O1)]
dipole: -2.5471032 0.5793696 0.5616782 debye
polarizability: 324.7103191|4.0071344|166.9367064|-14.3125622|7.2642205|115.487175 unknown
InChI: InChI=1S/C15H22O/c1-12(9-11-16)7-8-14-13(2)6-5-10-15(14,3)4/h7-9,11H,5-6,10H2,1-4H3
charge 0 multiplicity 1
38 atoms
O  6.009278 -0.735638 -0.659772
C  -2.374209 1.038527 -0.115217
C  -3.819562 0.461978 -0.055987
C  -3.939932 -0.910705 -0.738837
C  -1.309523 -0.060264 0.181534
C  -3.04989 -1.916605 0.010171
C  -1.644753 -1.399368 0.291143
C  -2.299914 2.186334 0.938474
C  -2.104254 1.642692 -1.525993
C  0.064167 0.44352 0.350118
C  -0.694087 -2.494199 0.745511
C  1.240033 -0.175311 -0.019187
C  2.580244 0.379675 0.166371
C  2.723237 1.728579 0.852466
C  3.662329 -0.361053 -0.294023
C  5.074956 -0.000381 -0.210349
H  -4.509489 1.195789 -0.516262
H  -4.123786 0.355981 1.00599
H  -3.621737 -0.841518 -1.796978
H  -4.991004 -1.255906 -0.740855
H  -2.964915 -2.865789 -0.558617
H  -3.526512 -2.196329 0.975715
H  -3.176558 2.850508 0.818782
H  -2.314253 1.786317 1.969162
H  -1.401084 2.817907 0.820803
H  -2.245257 0.889158 -2.321671
H  -2.792279 2.487031 -1.722323
H  -1.067575 2.018033 -1.605561
H  0.146826 1.454836 0.770097
H  0.162882 -2.108687 1.320965
H  -0.292198 -3.06963 -0.11318
H  -1.241946 -3.221495 1.375607
H  1.196127 -1.147592 -0.525623
H  2.179875 2.510558 0.289111
H  3.770925 2.050118 0.944832
H  2.286895 1.696506 1.8680
H  3.472022 -1.329013 -0.779149
H  5.325819 0.97334 0.276232
