program: Gaussian 09
title: 000229897
version: EM64L-G09RevD.01
frameworkgroup: C1[X(C15H22O2)]
method: RPBEPBE
basis: SDD
operation: Freq
keyword: #pfreq=noraman
keyword: PBEPBE/SDD
title: #p freq=noraman PBEPBE/SDD
converged: YES YES NO NO
title: Mulliken charges:
elementType: O O C C C C C C C C C C C C C C C H H H H H H H H H H H H H H H H H H H H H H
charge: -0.309761 -0.206029 -0.372524 -0.367835 -0.351629 -0.369865 -0.356191 -0.521942 -0.695806 0.205812 0.256461 0.332271 -0.357054 -0.381747 -0.813030 -0.217745 -0.234595 0.193919 0.190956 0.189930 0.192228 0.188187 0.187186 0.227022 0.205553 0.196095 0.195209 0.243322 0.253007 0.209862 0.216036 0.209537 0.248378 0.232683 0.223875 0.231230 0.268713 0.230589 0.227690
chargesum: 0.00000
title: Mulliken charges with hydrogens summed into heavy atoms:
elementType: O O C C C C C C C C C C C C C C C
charge: -0.309761 -0.206029 0.012352 0.014324 0.023743 0.062709 0.035114 -0.025613 -0.060372 0.205812 0.256461 0.332271 -0.108675 -0.149064 -0.089213 0.012844 -0.006904
polarizability: 2.32724063e+02 -3.42836269e+00 1.56105130e+02 7.22164712e+00 7.16950950e-01 1.13870538e+02
1716.lowfreq: -20.7476 -1.2688 -0.0002 0.0006 0.0012 6.6147 13.1320 26.9161 31.2103
frequency: -15.7162 26.6383 30.9114 50.5482 60.3915 73.3250 83.1026 98.3540 128.0242 143.2205 149.4693 154.7906 170.1336 194.6211 226.0279 261.4938 279.7048 295.6648 340.9513 412.0489 421.5702 447.3948 471.7922 515.4440 518.5881 562.7186 598.1717 673.2071 716.2019 721.1218 727.6123 732.2226 758.8827 772.3631 811.6867 824.8610 863.0283 881.8602 890.1717 907.3960 944.4147 983.6406 985.4530 993.5562 998.8515 1029.7082 1039.5988 1049.4137 1051.9495 1072.4283 1080.3889 1083.9788 1097.0772 1116.0780 1125.5488 1161.5583 1169.9181 1188.6021 1220.8829 1223.8792 1229.6093 1265.1307 1272.7841 1278.9720 1281.6984 1293.5429 1295.0785 1314.3239 1345.5712 1355.6746 1361.8705 1377.7456 1389.2756 1396.3723 1431.9480 1439.4391 1462.2810 1463.0361 1463.9237 1468.6018 1475.8189 1476.6186 1476.8580 1483.3998 1485.4203 1488.4358 1588.1560 1618.1891 1665.3079 2950.8013 2951.6946 2959.6046 2968.2176 2971.8074 2977.9799 2981.6948 2985.6758 2989.8561 2996.3658 3014.8863 3033.0686 3041.7420 3064.0400 3064.5103 3068.3289 3070.6355 3090.7800 3124.8179 3139.2556 3155.1229 3170.9833
redmass: 2.4755 3.4036 2.8489 3.1888 5.4554 1.9446 3.6916 3.2661 1.8730 2.2934 3.1140 1.3494 3.2171 2.7944 1.1301 3.6006 4.3318 3.7782 3.7273 3.3254 3.7799 2.9328 3.1937 3.8889 3.8437 4.0550 5.9947 4.9056 3.3522 1.0734 1.1471 2.4792 1.1985 1.7224 4.6488 1.2873 1.4250 4.3885 1.9647 1.2771 1.3950 1.3212 1.6172 1.1865 4.7138 3.0936 2.0297 1.7238 2.8162 2.3026 2.5679 2.3027 2.3208 1.8929 2.2203 1.9912 1.0797 1.6967 1.7095 1.8032 1.3675 1.2680 1.2834 1.4768 1.0418 1.1332 1.0921 1.4013 1.5201 1.6615 1.6657 7.4275 1.2177 1.2417 2.1915 1.0830 1.0732 1.0688 1.0728 1.0755 1.0901 1.0459 2.2233 1.0835 1.1965 1.0917 6.0370 7.2848 10.4171 1.0589 1.0588 1.0591 1.0585 1.0367 1.0654 1.0365 1.0948 1.0647 1.0974 1.1026 1.1025 1.0988 1.0978 1.1004 1.1007 1.0993 1.0996 1.0867 1.0893 1.0944 1.1003
irintensity: 0.0290 0.1571 0.0624 0.1277 1.1031 0.5930 0.7541 1.6098 0.3232 0.2112 1.3640 1.3020 0.7668 5.0667 0.0020 1.5209 2.6645 3.5772 3.8596 2.2153 4.4066 7.1580 2.7530 2.3748 0.9127 0.9765 0.3700 1.7818 8.1068 14.7745 0.7494 18.1238 2.6333 61.7168 13.0053 0.3028 3.3413 31.9088 13.6230 2.2808 3.1384 0.0556 0.9016 2.0120 15.5647 46.2912 5.5270 9.0129 25.8574 234.3910 1.8492 105.9214 108.3952 9.3409 108.3607 37.1042 1.2581 0.6367 48.1047 0.2700 7.2126 8.0401 14.4790 1.0735 1.3618 0.1360 0.3313 23.7095 19.0933 0.6627 8.6403 2.3998 11.6198 12.5370 6.0399 22.4167 0.0102 0.3572 20.7777 2.3216 0.7139 13.5694 28.0316 5.3088 42.9688 26.8051 10.0373 1.2380 137.9543 2.6920 2.6936 22.7742 111.5902 36.1195 3.3547 20.1449 2.3318 39.3124 3.9502 0.8372 45.1036 38.7161 4.9040 49.7343 110.3119 54.0456 21.4813 5.3033 11.1606 26.8284 16.2166
temp: 298.150 k
press: 1.00000 atm
elementType: 8 8 6 6 6 6 6 6 6 6 6 6 6 6 6 6 6 1 1 1 1 1 1 1 1 1 1 1 1 1 1 1 1 1 1 1 1 1 1
symmnumber: 1
zpe: 875245.3 jmol-1
zpe.correction: 0.333363 hartree
zpe.thermalcorrener: 0.351668 hartree
zpe.thermalcorrenthalpy: 0.352612 hartree
zpe.thermalcorrgfe: 0.284943 hartree
zpe.sumelectzpe: -733.943547 hartree
zpe.sumelectthermal: -733.925242 hartree
zpe.sumelectthermalent: -733.924298 hartree
zpe.sumelectthermalfe: -733.991967 hartree
dipole: -0.5439 -0.2408 -1.3106
dipole: 1.4393
quadrupole: -93.5534 -96.5968 -110.7818
quadrupole: 1.0053 0.2487 -3.0646
quadrupole: 6.7572 3.7139 -10.4711 1.0053 0.2487 -3.0646
hfenergy: -734.27691 hartree
pointgroup: C01[X(C15H22O2)]
dipole: -0.2147128 0.1762437 -0.4934361 debye
polarizability: 232.6246986|-7.376281|145.2025897|4.1985274|18.566051|124.8724419 unknown
InChI: InChI=1S/C15H22O2/c1-3-4-5-6-7-12-15(16)17-14-11-9-8-10-13(14)2/h8-11H,3-7,12H2,1-2H3
charge 0 multiplicity 1
39 atoms
O  1.669365 -0.228089 -0.894319
O  0.822588 -0.427134 1.286275
C  -4.467824 0.144451 0.403827
C  -3.258932 -0.242781 -0.477352
C  -5.826644 -0.037238 -0.309345
C  -1.905437 -0.060254 0.243495
C  -7.035787 0.356279 0.569687
C  -0.710381 -0.422764 -0.661951
C  -8.389362 0.17511 -0.150777
C  0.624974 -0.360641 0.058243
C  3.040375 -0.197518 -0.455521
C  3.555059 0.935425 0.223706
C  3.843758 -1.29326 -0.824109
C  4.93854 0.915657 0.536534
C  2.677458 2.112913 0.595129
C  5.217708 -1.284663 -0.499091
C  5.764486 -0.176335 0.187116
H  -4.455614 -0.465642 1.331017
H  -4.362208 1.201317 0.726738
H  -3.365499 -1.300139 -0.799386
H  -3.272967 0.367646 -1.4048
H  -5.936604 -1.0949 -0.62871
H  -5.838391 0.570217 -1.238781
H  -1.873642 -0.685822 1.15544
H  -1.804137 0.988993 0.584891
H  -7.024776 -0.251912 1.497298
H  -6.924164 1.412406 0.890012
H  -0.828429 -1.45737 -1.046128
H  -0.661359 0.226161 -1.555145
H  -8.538641 -0.878233 -0.454993
H  -9.236534 0.462154 0.499052
H  -8.438297 0.797239 -1.064534
H  3.388365 -2.132339 -1.359327
H  5.369547 1.776614 1.06117
H  3.289194 2.985426 0.87956
H  2.021259 2.407492 -0.24426
H  2.023253 1.85585 1.448598
H  5.850789 -2.133131 -0.779413
H  6.82931 -0.158992 0.443653
