program: Gaussian 09
title: 000229895
version: EM64L-G09RevD.01
frameworkgroup: C1[X(C14H20O2)]
method: RPBEPBE
basis: SDD
operation: Freq
keyword: #pfreq=noraman
keyword: PBEPBE/SDD
title: #p freq=noraman PBEPBE/SDD
converged: YES YES NO NO
title: Mulliken charges:
elementType: O O C C C C C C C C C C C C C C H H H H H H H H H H H H H H H H H H H H
charge: -0.292787 -0.218794 -0.372064 -0.365810 -0.351343 -0.371323 -0.356271 -0.521847 -0.695818 0.202793 0.371113 -0.323057 -0.398136 -0.210229 -0.196040 -0.247817 0.191799 0.192563 0.190561 0.189275 0.187292 0.187391 0.211793 0.222232 0.195594 0.195723 0.251473 0.247766 0.209557 0.216035 0.209709 0.302861 0.256092 0.228978 0.230715 0.230021
chargesum: 0.00000
title: Mulliken charges with hydrogens summed into heavy atoms:
elementType: O O C C C C C C C C C C C C C C
charge: -0.292787 -0.218794 0.012298 0.014026 0.023340 0.062701 0.035046 -0.022608 -0.060517 0.202793 0.371113 -0.020195 -0.142044 0.018749 0.034675 -0.017796
polarizability: 2.34205749e+02 2.50849250e+00 1.48360995e+02 2.25962597e+00 7.32084816e-01 9.44863872e+01
1716.lowfreq: -25.4856 -4.4233 -0.0009 0.0009 0.0013 1.3537 9.4516 18.6697 33.1602
frequency: -18.6250 18.1387 33.1091 38.4298 53.0566 67.6405 91.0247 105.2403 126.4307 135.1767 171.0841 187.6607 235.0910 248.0386 278.9702 323.1239 351.5968 410.1138 415.4966 466.3095 499.0392 534.7274 574.8780 606.9176 694.5754 695.2319 719.1464 726.3541 757.8910 759.6364 765.4178 822.1137 844.9900 887.9118 892.0265 905.7648 924.1906 977.6586 986.5424 993.5818 995.7405 1000.3328 1022.2918 1030.4730 1053.8486 1076.9329 1080.3612 1082.8270 1094.5046 1113.4412 1124.0487 1152.0590 1170.0248 1188.6279 1191.3469 1222.6478 1228.5136 1265.5124 1270.7728 1281.3897 1291.5471 1293.5717 1311.9905 1312.9605 1345.0843 1355.7705 1362.0968 1382.4748 1390.6934 1436.0307 1442.5219 1460.8707 1462.2017 1467.5971 1469.4043 1475.1287 1477.9608 1482.8356 1488.6751 1589.6443 1607.8427 1651.2325 2950.0427 2951.3641 2959.2181 2968.1308 2971.8365 2979.9188 2985.0462 2991.9783 2995.1574 3014.2152 3030.7369 3036.9595 3061.4951 3068.2557 3070.8467 3131.9289 3143.1034 3159.6834 3172.8656 3211.2857
redmass: 2.0413 3.7542 4.7161 5.5155 3.5243 1.6861 3.4672 3.8218 1.8508 2.1479 5.0254 4.1823 1.1115 4.9778 4.0875 6.3778 3.9985 2.9448 3.3852 3.2285 3.0032 3.0249 5.7332 6.4192 2.3697 5.5622 1.0743 1.1103 1.5862 2.8699 1.5263 1.2765 1.2512 2.9021 3.0200 1.2746 1.4021 1.3576 6.2562 1.1875 1.3001 4.5185 2.2254 3.0246 3.3085 1.9705 1.7164 2.3367 2.4698 1.6302 2.7352 2.3594 1.0687 1.6944 1.3866 1.3244 1.3698 1.2496 1.3173 1.0405 1.1114 1.1001 1.3307 1.4092 1.5236 1.6634 1.6824 9.3634 1.2175 1.1074 2.1826 1.0728 1.0713 1.1014 2.0976 1.0777 1.0427 1.0830 1.0899 6.3877 6.4434 10.1634 1.0589 1.0589 1.0591 1.0585 1.0368 1.0638 1.0967 1.0627 1.0972 1.1027 1.0999 1.1015 1.1023 1.1007 1.0993 1.0853 1.0903 1.0950 1.0997 1.0947
irintensity: 0.0035 0.1262 0.5354 1.1029 0.0517 0.5486 1.3420 0.9468 0.3661 0.3688 0.9095 3.5968 0.0121 0.3577 3.9266 1.1796 6.1974 0.0404 4.0421 1.5891 10.5152 1.0542 0.0646 1.5108 29.9646 5.6489 16.7852 0.1758 4.7671 5.9022 91.4594 0.0760 0.0133 7.6613 29.8846 2.8144 11.0734 0.0883 5.4325 0.0989 1.9072 10.3745 1.2917 55.1079 31.0767 91.9615 9.0676 0.2917 262.9427 21.6690 163.6568 146.5377 2.4585 0.1059 83.9483 32.3897 4.8906 5.2973 20.5835 0.4679 0.3516 0.4261 0.6049 24.2231 16.9711 0.5609 7.6382 11.4153 11.6392 27.8673 4.7351 0.2764 0.4824 11.3573 84.2349 2.2266 12.2861 5.0272 24.9695 21.9311 17.0702 166.5482 3.1682 2.8459 25.0862 110.3411 36.0807 5.4329 1.2964 37.2617 4.1981 1.0319 23.4541 53.4308 61.5328 103.6807 54.5253 0.1246 16.8196 26.9889 12.1700 4.1839
temp: 298.150 k
press: 1.00000 atm
elementType: 8 8 6 6 6 6 6 6 6 6 6 6 6 6 6 6 1 1 1 1 1 1 1 1 1 1 1 1 1 1 1 1 1 1 1 1
symmnumber: 1
zpe: 803784.2 jmol-1
zpe.correction: 0.306145 hartree
zpe.thermalcorrener: 0.322849 hartree
zpe.thermalcorrenthalpy: 0.323793 hartree
zpe.thermalcorrgfe: 0.258794 hartree
zpe.sumelectzpe: -694.715027 hartree
zpe.sumelectthermal: -694.698323 hartree
zpe.sumelectthermalent: -694.697379 hartree
zpe.sumelectthermalfe: -694.762378 hartree
dipole: 0.2260 -1.5949 0.0236
dipole: 1.6110
quadrupole: -85.1537 -96.7088 -99.2849
quadrupole: 1.4375 0.2932 0.3790
quadrupole: 8.5621 -2.9930 -5.5691 1.4375 0.2932 0.3790
hfenergy: -695.0211718 hartree
pointgroup: C01 [X(C14H20O2)]
dipole: 0.089205 0.2848442 0.5591401 debye
polarizability: 234.2236043|0.2469448|104.3965397|-2.9587011|20.9070301|138.4329877 unknown
InChI: InChI=1S/C14H20O2/c1-2-3-4-5-9-12-14(15)16-13-10-7-6-8-11-13/h6-8,10-11H,2-5,9,12H2,1H3
charge 0 multiplicity 1
36 atoms
O  -1.832696 0.302233 0.50248
O  -0.867929 -0.595136 -1.453765
C  4.372322 -0.319379 -0.346711
C  3.103952 0.264638 0.315342
C  5.684151 0.196144 0.286613
C  1.798081 -0.232868 -0.342115
C  6.953137 -0.397236 -0.367189
C  0.545948 0.338946 0.35103
C  8.259701 0.130254 0.26423
C  -0.751277 -0.055277 -0.334867
C  -3.218725 0.126186 0.190703
C  -3.733333 -0.423971 -1.007441
C  -4.075845 0.569262 1.223934
C  -5.13786 -0.520364 -1.150014
C  -5.472233 0.462945 1.061287
C  -6.010202 -0.082896 -0.128699
H  4.343544 -1.42707 -0.280193
H  4.366739 -0.073594 -1.429132
H  3.102488 0.002627 1.394332
H  3.143578 1.373294 0.2645
H  5.687746 -0.040863 1.371359
H  5.718573 1.303387 0.210894
H  1.761855 -1.339382 -0.313468
H  1.783925 0.046549 -1.412624
H  6.921433 -1.503023 -0.285527
H  6.945219 -0.166097 -1.452046
H  0.490224 0.02417 1.410166
H  0.587574 1.447411 0.372186
H  8.305189 -0.11341 1.342625
H  9.150938 -0.31031 -0.219436
H  8.331088 1.230146 0.166618
H  -3.062553 -0.764707 -1.796108
H  -3.635109 0.988227 2.133567
H  -5.546081 -0.94463 -2.074064
H  -6.136994 0.805729 1.861532
H  -7.09477 -0.165539 -0.2564
