program: Gaussian 09
title: 000229882
version: EM64L-G09RevD.01
frameworkgroup: C1[X(C11H13BrO3)]
method: RPBEPBE
basis: SDD
operation: Freq
keyword: #p
keyword: freq=noraman
keyword: PBEPBE/SDD
title: #p freq=noraman PBEPBE/SDD
converged: YES YES NO NO
title: Mulliken charges:
elementType: Br O O O C C C C C C C C C C C H H H H H H H H H H H H H
charge: -0.042614 -0.291868 -0.266099 -0.260604 -0.159122 0.541663 -0.452903 -0.481960 0.197537 -0.421728 0.164346 -0.325333 -0.649529 -0.204592 -0.504764 0.225364 0.300742 0.273610 0.238775 0.251741 0.258482 0.229529 0.238724 0.234429 0.241291 0.233038 0.203584 0.228261
chargesum: 0.00000
title: Mulliken charges with hydrogens summed into heavy atoms:
elementType: Br O O O C C C C C C C C C C C
charge: -0.042614 -0.291868 -0.266099 -0.260604 0.066242 0.541663 -0.152160 -0.208350 0.197537 -0.182954 0.164346 -0.073592 0.077206 0.271128 0.160118
polarizability: 1.75388273e+02 1.71380192e+01 1.30895678e+02 7.50302142e+00 -1.19234619e+01 1.20615944e+02
1716.lowfreq: -5.2397 -1.5420 -0.0006 -0.0002 -0.0002 7.8774 26.5033 43.7940 56.7752
frequency: 26.4688 43.7412 56.7500 90.4046 95.3397 127.2020 139.7253 183.9672 211.0137 227.4586 232.3633 244.0462 275.0626 318.9585 343.6145 370.7398 413.1416 448.7661 464.2221 547.3987 599.9790 614.1046 628.7850 676.7755 725.6475 759.4571 786.2711 813.2978 835.7892 875.7818 881.6560 903.9797 933.3031 940.5863 975.0954 1000.5579 1027.7151 1057.6547 1071.9368 1084.8749 1113.9578 1115.2806 1128.2411 1131.4279 1157.0173 1178.8787 1187.7146 1244.3277 1254.5531 1274.2280 1306.6148 1346.0746 1363.9556 1384.9026 1408.1386 1432.4733 1443.5589 1455.3297 1460.4072 1470.2484 1473.5719 1477.3400 1485.7035 1611.5119 1630.6005 2943.3254 2948.1549 2993.1823 3000.2944 3030.0141 3074.1320 3095.0523 3105.7010 3108.2212 3110.1029 3140.1049 3168.2472 3182.2224
redmass: 6.8494 6.0729 3.4494 2.7216 2.7895 4.4744 2.7325 2.3303 2.9412 2.8551 1.2122 5.7955 2.6118 4.8332 5.3990 4.2591 3.1613 3.9126 4.0337 5.9877 5.3289 4.8561 4.5612 9.1193 4.1382 5.8832 5.3317 1.4230 8.4183 2.5654 2.1233 2.2367 1.6692 1.9306 4.6995 1.5411 6.8050 3.5149 1.4973 2.5358 1.3816 1.5697 1.1107 1.3596 1.4954 1.4741 1.5967 3.7167 1.4121 1.3231 1.3775 1.5576 1.2686 1.2046 2.9054 1.1649 4.4983 1.0550 1.0482 1.0536 2.0979 1.0921 1.3243 7.8176 8.2319 1.0400 1.0781 1.0350 1.0609 1.1009 1.0891 1.0977 1.0998 1.0994 1.1104 1.0900 1.0927 1.0956
irintensity: 0.3856 0.8905 1.1478 3.9591 11.6211 5.1773 4.5066 0.1402 3.0603 2.2533 2.8176 1.3032 2.5802 7.0501 0.3194 3.0194 7.4929 1.2985 5.6068 14.9461 8.5617 16.0757 21.7181 0.6316 3.7573 18.9920 3.9787 44.2447 25.4773 16.4598 25.6817 2.5377 9.4594 18.1282 124.3174 6.6602 157.6253 18.9528 7.3166 9.1036 0.1798 1.5285 0.0253 3.2783 21.7833 20.4728 16.7604 208.6973 45.6112 3.9565 16.3798 12.5798 1.6320 23.1987 11.2068 1.4661 59.3693 10.0830 15.0352 4.9591 89.3375 15.5616 29.1924 4.7622 0.7909 54.8553 48.6549 16.4935 120.2351 50.6686 1.4799 15.4914 22.7547 26.9583 30.0515 8.2895 0.8034 4.1767
temp: 298.150 k
press: 1.00000 atm
elementType: 35 8 8 8 6 6 6 6 6 6 6 6 6 6 6 1 1 1 1 1 1 1 1 1 1 1 1 1
symmnumber: 1
zpe: 571147.7 jmol-1
zpe.correction: 0.217539 hartree
zpe.thermalcorrener: 0.232724 hartree
zpe.thermalcorrenthalpy: 0.233669 hartree
zpe.thermalcorrgfe: 0.173143 hartree
zpe.sumelectzpe: -664.929541 hartree
zpe.sumelectthermal: -664.914355 hartree
zpe.sumelectthermalent: -664.913411 hartree
zpe.sumelectthermalfe: -664.973937 hartree
dipole: -1.0878 1.8318 0.6071
dipole: 2.2153
quadrupole: -91.5839 -97.5448 -94.3079
quadrupole: 6.5024 4.1684 3.4581
quadrupole: 2.8950 -3.0660 0.1709 6.5024 4.1684 3.4581
hfenergy: -665.1470795 hartree
pointgroup: C01 [X(C11H13Br1O3)]
dipole: 0.2572135 -0.8242421 -0.1186604 debye
polarizability: 180.4274443|7.7434948|114.8643356|-3.1851792|10.4521364|131.6081152 unknown
InChI: InChI=1S/C11H13BrO3/c1-7(12)11(13-2)8-3-4-9-10(5-8)15-6-14-9/h3-5,7,11H,6H2,1-2H3
charge 0 multiplicity 1
28 atoms
Br -2.347313 2.417875 1.17502
O  -2.3751 -1.330503 -0.780968
O  2.660756 0.236892 -1.659108
O  3.70945 0.088596 0.49247
C  -1.99143 -0.340632 0.253535
C  -0.476462 -0.227009 0.376677
C  -2.697355 0.954949 -0.220937
C  0.301747 -0.031317 -0.804112
C  1.681078 0.0782 -0.644191
C  0.152018 -0.330003 1.639426
C  2.30114 -0.011007 0.622892
C  1.562488 -0.221612 1.788072
C  -4.206575 0.809692 -0.40978
C  3.937637 0.457767 -0.930766
C  -1.985914 -2.701714 -0.43592
H  -2.423559 -0.641798 1.234039
H  -2.203401 1.351386 -1.122942
H  -0.168681 0.006006 -1.790664
H  -0.464625 -0.476309 2.533093
H  2.046657 -0.298767 2.764512
H  -4.39087 0.033463 -1.173861
H  -4.698248 0.498925 0.528763
H  -4.656396 1.760378 -0.741232
H  4.204193 1.530256 -0.985733
H  4.710531 -0.202536 -1.352526
H  -2.376515 -3.335356 -1.247508
H  -2.436954 -3.013093 0.529553
H  -0.885593 -2.810932 -0.373103
