program: Gaussian 09
title: 000229880
version: EM64L-G09RevD.01
frameworkgroup: C1[X(C12H15N3O4)]
method: RPBEPBE
basis: SDD
operation: Freq
keyword: #p
keyword: freq=noraman
keyword: PBEPBE/SDD
title: #p freq=noraman PBEPBE/SDD
converged: YES YES NO NO
title: Mulliken charges:
elementType: O O O O N N N C C C C C C C C C C C C H H H H H H H H H H H H H H H
charge: -0.263253 -0.241588 -0.231389 -0.228117 0.002529 -0.444449 0.017278 -0.496111 -0.500996 0.146077 -0.812883 0.493383 0.262178 -0.400554 -0.347950 0.383428 -0.342048 -0.339993 -0.504131 0.245914 0.246989 0.268564 0.240867 0.244034 0.258551 0.239346 0.300633 0.227105 0.284669 0.284080 0.283690 0.241969 0.245370 0.236808
chargesum: 0.00000
title: Mulliken charges with hydrogens summed into heavy atoms:
elementType: O O O O N N N C C C C C C C C C C C C
charge: -0.263253 -0.241588 -0.231389 -0.228117 0.002529 -0.143815 0.017278 -0.003208 0.008436 0.146077 -0.070952 0.493383 0.262178 -0.173450 -0.063281 0.383428 -0.057969 -0.056303 0.220017
polarizability: 3.58766148e+02 -3.37394212e+01 1.68586773e+02 -1.09464048e+01 -1.14849413e+01 1.00641901e+02
1716.lowfreq: -5.9492 -0.0005 0.0002 0.0004 3.3399 7.9634 15.0011 23.3782 32.1150
frequency: 13.9623 23.3345 32.0750 42.3517 61.5652 75.4583 85.1003 87.8075 115.2935 133.0604 146.9531 173.8506 186.8969 204.5071 235.4877 264.9195 292.3005 318.4107 344.2861 377.7168 414.9982 425.1588 477.1696 492.4061 503.7815 522.7120 553.0298 569.9324 589.8677 628.1363 648.0898 666.5591 681.1898 733.1254 764.6702 780.4621 814.2808 824.4308 856.0127 864.0811 866.7853 944.4497 971.4121 977.5792 991.2691 1001.3827 1006.9310 1020.4005 1047.6723 1094.2639 1097.4682 1112.7611 1115.1840 1136.1826 1148.5428 1169.9237 1179.2992 1227.7893 1253.5784 1269.6060 1283.6967 1291.9712 1309.9975 1344.9320 1350.6306 1388.3377 1394.7120 1422.2716 1441.5288 1444.6669 1452.6553 1460.3922 1463.2493 1463.8518 1477.7702 1486.0931 1521.3799 1589.9894 1599.6995 1620.3532 1643.7042 2955.6403 2987.1850 2999.3230 3006.9889 3025.6082 3068.8204 3089.1499 3102.3729 3109.7364 3126.1033 3153.3985 3175.3512 3184.1659 3197.3007 3439.4849
redmass: 5.7283 6.3760 5.0811 3.2924 4.6450 5.2428 4.4470 1.0994 2.6036 5.2363 1.7312 2.5833 3.3507 4.6546 4.0198 4.8599 5.7732 4.3661 3.3637 4.2313 2.8885 3.2373 2.2682 4.0112 3.5488 4.2895 3.6909 2.5167 2.5202 7.0326 6.6584 4.8794 4.3278 4.7236 2.4636 3.0706 3.7003 1.3531 4.2344 1.5378 3.8983 4.8083 1.6966 1.3305 2.9709 1.3240 2.1692 1.9837 3.4320 2.6539 2.6832 1.2706 1.3483 2.7813 1.4549 1.3408 1.4870 5.4555 1.4982 2.0391 1.4493 1.3448 1.9730 3.0221 2.5390 1.2770 3.8165 1.1886 1.3666 2.3500 1.0501 1.2132 1.1272 1.0735 1.0464 1.9864 2.2659 5.4659 7.6570 6.5276 9.0553 1.0403 1.0654 1.0634 1.0296 1.0974 1.0937 1.0994 1.0950 1.1047 1.0904 1.1050 1.0894 1.0944 1.0960 1.0748
irintensity: 1.6967 1.8988 0.3971 0.2155 0.6400 1.0899 0.4375 0.2168 2.3351 2.5481 2.0683 2.8432 5.3507 4.2257 3.5701 8.5040 4.5246 27.3646 7.0374 0.1239 9.6882 4.2310 18.9618 12.6236 5.8387 4.0263 10.3510 16.2788 26.3824 2.4958 5.3626 25.6887 2.0792 2.8911 1.5010 19.3169 11.0390 22.7841 7.2810 60.5184 15.0547 13.7494 4.9688 1.6687 4.7148 0.0466 45.6654 7.8361 27.8698 36.1782 48.4053 2.6236 29.3867 431.1528 21.3375 200.4112 35.2853 722.7278 49.6678 50.3229 40.8355 38.8996 92.3918 48.1695 61.5974 27.4115 84.1476 25.3185 18.3210 2.2571 15.1906 46.0796 15.9519 24.5540 12.1786 38.4947 109.1912 23.1538 6.0495 531.6202 169.7875 20.8407 9.8330 9.5787 34.9378 16.1665 2.2598 13.5344 17.0634 25.5589 12.7173 14.9158 0.3784 1.8425 0.9047 37.1046
temp: 298.150 k
press: 1.00000 atm
elementType: 8 8 8 8 7 7 7 6 6 6 6 6 6 6 6 6 6 6 6 1 1 1 1 1 1 1 1 1 1 1 1 1 1 1
symmnumber: 1
zpe: 686240.3 jmol-1
zpe.correction: 0.261375 hartree
zpe.thermalcorrener: 0.280922 hartree
zpe.thermalcorrenthalpy: 0.281866 hartree
zpe.thermalcorrgfe: 0.209373 hartree
zpe.sumelectzpe: -929.908522 hartree
zpe.sumelectthermal: -929.888975 hartree
zpe.sumelectthermalent: -929.888031 hartree
zpe.sumelectthermalfe: -929.960524 hartree
dipole: -8.6980 4.5474 -1.9859
dipole: 10.0139
quadrupole: -153.8748 -98.8819 -116.0580
quadrupole: 19.9409 9.5460 -2.6849
quadrupole: -30.9366 24.0563 6.8803 19.9409 9.5460 -2.6849
hfenergy: -930.1698971 hartree
pointgroup: C01 [X(C12H15N3O4)]
dipole: 3.4347802 1.701908 0.9096378 debye
polarizability: 359.8027329|31.5537034|166.3777431|-6.1433155|15.3479574|101.8143465 unknown
InChI: InChI=1S/C12H15N3O4/c1-9(3-8-12(16)19-2)13-14-10-4-6-11(7-5-10)15(17)18/h4-7,14H,3,8H2,1-2H3
charge 0 multiplicity 1
34 atoms
O  5.852389 -1.371397 0.946657
O  5.86003 -0.249664 -1.094897
O  -6.629051 -0.17949 0.328673
O  -5.757715 -2.127612 -0.489051
N  0.677269 0.6672 -0.298064
N  -0.441478 1.382821 0.105257
N  -5.631086 -0.909439 -0.063781
C  3.045782 0.441607 -0.691672
C  3.979375 0.058318 0.487224
C  1.855154 1.260149 -0.240963
C  2.075197 2.688125 0.23573
C  -1.708548 0.797168 0.052825
C  5.302033 -0.511243 -0.004687
C  -2.837626 1.560966 0.474852
C  -1.890147 -0.539416 -0.410072
C  -4.286439 -0.324171 -0.023842
C  -4.12269 1.004415 0.437414
C  -3.1759 -1.095237 -0.446761
C  7.174162 -1.954418 0.600012
H  3.640706 1.006164 -1.435508
H  2.679837 -0.47408 -1.186344
H  3.496162 -0.665625 1.164374
H  4.219211 0.952228 1.098549
H  1.508379 3.414064 -0.382619
H  3.13877 2.964527 0.166001
H  1.761421 2.831054 1.290178
H  -0.36205 2.347437 0.449564
H  -2.700734 2.589537 0.830356
H  -1.015071 -1.10829 -0.729776
H  -5.001742 1.570805 0.755357
H  -3.343179 -2.117221 -0.797094
H  7.918735 -1.15319 0.458525
H  7.097172 -2.545458 -0.327675
H  7.432174 -2.590931 1.457457
