program: Gaussian 09
title: 000229864
version: EM64L-G09RevD.01
frameworkgroup: C1[X(C6H7ClN6)]
method: RPBEPBE
basis: SDD
operation: Freq
keyword: #p
keyword: freq=noraman
keyword: PBEPBE/SDD
title: #p freq=noraman PBEPBE/SDD
converged: NO YES NO NO
title: Mulliken charges:
elementType: Cl N N N N N N C C C C C C H H H H H H H
charge: 0.034082 -0.192345 -0.048252 -0.050097 -0.049065 -0.000405 -0.579068 0.203663 -0.347018 0.065291 -0.657788 -0.252249 0.005985 0.246802 0.234554 0.242007 0.224429 0.235002 0.345955 0.338518
chargesum: 0.00000
title: Mulliken charges with hydrogens summed into heavy atoms:
elementType: Cl N N N N N N C C C C C C
charge: 0.034082 -0.192345 -0.048252 -0.050097 -0.049065 -0.000405 0.105405 0.203663 0.134338 0.065291 0.043650 -0.252249 0.005985
polarizability: 1.56783102e+02 -4.83532545e+00 1.45152109e+02 -5.61034121e+00 -3.77669866e-01 5.68282971e+01
1716.lowfreq: -12.5042 -6.1196 -0.0025 -0.0014 0.0013 5.4375 16.0840 64.8851 126.8959
frequency: 12.8582 64.8807 126.8946 157.7836 171.1549 200.5245 228.4188 255.5210 315.3808 334.4012 397.7429 415.9794 489.6888 505.8833 518.9855 536.5374 599.7599 615.0628 642.9359 682.8253 718.5367 768.3692 788.8318 792.3931 874.7894 907.5385 947.2434 969.1412 1053.0029 1086.4777 1122.2470 1147.3948 1199.8623 1242.3297 1308.9601 1322.7490 1347.6655 1362.0336 1390.4436 1414.5637 1461.0751 1470.9660 1485.1054 1494.4088 1520.7286 1591.1932 1615.0962 2996.4186 3023.3490 3084.6245 3097.3395 3111.9640 3559.1817 3716.4960
redmass: 2.4963 5.2066 6.5583 2.5457 6.6137 3.1154 4.3720 1.6853 5.4443 5.9359 6.3301 5.5057 5.6093 1.2143 5.8093 1.0694 9.5002 5.8139 11.1665 4.4832 11.8661 1.8377 11.0364 3.8317 4.4119 5.5548 4.9260 2.3859 2.2553 2.3430 5.6089 2.6344 4.1863 5.3153 1.5108 3.0843 1.3373 9.3969 1.2432 4.8406 1.1604 1.0419 1.0555 6.2630 3.1733 10.7703 1.6496 1.0353 1.0612 1.1022 1.0992 1.1033 1.0445 1.1061
irintensity: 0.1355 1.0465 0.5341 1.8746 1.3709 0.3065 0.5685 2.1085 13.8469 9.1534 2.6853 0.3579 4.7128 310.7398 9.6397 0.2797 1.2177 1.4958 1.4982 2.3611 9.6011 20.3182 10.3844 10.3835 7.3147 121.4306 34.3500 2.0109 0.7507 8.6559 91.4023 25.2368 24.6943 1.5110 0.5419 9.4490 21.8158 67.2436 30.8122 77.4972 23.6636 16.4720 11.8445 235.2338 66.0484 404.8939 447.9025 19.9572 21.7177 0.2372 35.9348 20.2373 162.3327 56.8227
temp: 298.150 k
press: 1.00000 atm
elementType: 17 7 7 7 7 7 7 6 6 6 6 6 6 1 1 1 1 1 1 1
symmnumber: 1
zpe: 372431.8 jmol-1
zpe.correction: 0.141852 hartree
zpe.thermalcorrener: 0.153468 hartree
zpe.thermalcorrenthalpy: 0.154413 hartree
zpe.thermalcorrgfe: 0.102367 hartree
zpe.sumelectzpe: -1020.441403 hartree
zpe.sumelectthermal: -1020.429787 hartree
zpe.sumelectthermalent: -1020.428843 hartree
zpe.sumelectthermalfe: -1020.480888 hartree
dipole: 2.8116 5.6492 -0.1317
dipole: 6.3116
quadrupole: -75.9734 -78.9221 -82.0953
quadrupole: -2.8564 -0.0808 -0.6043
quadrupole: 3.0235 0.0748 -3.0983 -2.8564 -0.0808 -0.6043
hfenergy: -1020.5832553 hartree
pointgroup: C01 [X(C6H7Cl1N6)]
dipole: -0.471273 -2.4380279 0.0021528 debye
dipolederiv: -0.4678924 -0.4434195 -0.0473281 -0.4565135 -0.6187448 -0.0549971 -0.0543176 -0.0606145 -0.0661962 -0.5024271 0.0979629 0.0143449 -0.2816904 -0.5668552 0.0158614 -0.0394136 0.0416007 -0.1424448 -0.3075676 0.3460601 -0.0099636 0.405033 0.4855611 0.0109081 -0.0014495 0.0453345 -0.1869277 -0.9464289 0.4996636 -0.0456869 0.1669439 -0.7595206 -0.0099627 -0.0596808 0.0434712 -0.2315933 -0.1252519 -0.4143654 0.0329591 -0.2465472 -0.1014089 -0.0133309 -0.0081405 -0.0454001 -0.1265778 -0.4471901 -0.015222 -0.0211891 0.199501 -1.5375659 -0.0031516 -0.0279802 -0.0248345 -0.1937743 -0.5565711 0.53961 0.0368946 0.7792695 -1.3483629 0.0605629 0.0290101 0.0521152 -0.6930567 0.7084312 -0.3214167 0.0184231 -0.1660333 0.5701035 0.0125101 0.0511679 -0.0319918 0.1443471 0.6541893 0.1706408 -0.0353691 0.2651813 0.2333975 0.0065246 0.0398635 0.0009713 0.2670284 -0.7752387 -0.1139998 -0.0867146 -0.1635301 -0.4712549 -0.0063408 -0.1021492 -0.025817 0.0706168 -0.0529591 -0.031628 0.0151103 -0.0713141 0.0232427 0.0313054 -0.0093551 0.043596 -0.061017 1.3966112 0.292486 0.1378896 0.4082223 1.6259228 0.0674692 0.1582757 0.0584401 0.1000834 0.9948597 -0.5322645 0.0566809 -0.7394574 1.8999183 -0.0351197 0.0757933 -0.029539 0.2076825 -0.0161118 0.0111228 -0.040139 0.0827413 0.0185955 0.0903855 -0.0267754 0.0505065 0.0525389 0.012025 0.0085275 0.0772305 -0.0743653 -0.0111502 -0.0989685 0.0297329 -0.0653524 -0.0214261 0.0186351 0.1109895 -0.0685532 0.090837 0.0274395 0.0608038 -0.0401499 0.0363197 0.0432729 -0.125739 -0.1254744 -0.0150398 -0.1529505 0.038605 -0.0056203 -0.0028857 -0.0087199 0.0803823 0.1162937 0.0099242 0.0244538 0.0522335 -0.0319751 -0.1152466 0.0312217 -0.0649153 -0.0202235 0.2834437 -0.1092892 -0.0160689 -0.042398 0.227064 -0.0077202 -0.0125175 -0.0158554 0.3906873 0.1388889 0.0200921 -0.0279346 -0.055163 0.2969886 -0.0058724 -0.0302503 0.0006846 0.3865977 unknown
polarizability: 158.2011217|-0.9994505|143.5300726|7.2820553|-0.3956084|57.0323132 unknown
InChI: InChI=1S/C6H7ClN6/c1-2-13-5-3(11-12-13)4(7)9-6(8)10-5/h2,8H2,1H3
charge 0 multiplicity 1
20 atoms
Cl 2.86707 2.237936 0.239033
N  -1.708012 0.242704 -0.329092
N  -1.743944 1.681727 -0.309041
N  0.069537 -1.461299 -0.142355
N  -0.488115 2.127455 -0.154217
N  2.282946 -0.400404 0.127536
N  2.042257 -2.72435 0.058195
C  -0.4133 -0.191657 -0.177608
C  -2.949951 -0.533849 -0.450128
C  0.360264 1.01555 -0.070196
C  -3.421865 -1.101039 0.903892
C  1.753238 0.819739 0.086747
C  1.431056 -1.4997 0.010663
H  -3.700781 0.151722 -0.877062
H  -2.769294 -1.350869 -1.17135
H  -2.666274 -1.78342 1.328943
H  -4.359298 -1.667559 0.762212
H  -3.612606 -0.287666 1.624483
H  3.051781 -2.767509 0.170147
H  1.47949 -3.566809 -0.0241
