program: Gaussian 09
title: 000229862
version: EM64L-G09RevD.01
frameworkgroup: C1[X(C8H13ClN4)]
method: RPBEPBE
basis: SDD
operation: Freq
keyword: #p
keyword: freq=noraman
keyword: PBEPBE/SDD
title: #p freq=noraman PBEPBE/SDD
converged: YES YES NO NO
title: Mulliken charges:
elementType: Cl N N N N C C C C C C C C H H H H H H H H H H H H H
charge: -0.052551 -0.362152 -0.126224 -0.015578 -0.589856 -0.417589 -0.342260 -0.337887 -0.686798 0.254573 -0.244853 -0.182860 -0.032996 0.206919 0.207262 0.218201 0.218261 0.198365 0.198355 0.320042 0.211255 0.221410 0.211273 0.261902 0.335087 0.328700
chargesum: 0.00000
title: Mulliken charges with hydrogens summed into heavy atoms:
elementType: Cl N N N N C C C C C C C C
charge: -0.052551 -0.042110 -0.126224 -0.015578 0.073931 -0.003409 0.094201 0.058834 -0.042859 0.254573 0.017049 -0.182860 -0.032996
polarizability: 1.80693522e+02 -3.17717814e+00 1.42781782e+02 -3.36892474e-02 6.65046394e-04 6.86383198e+01
1716.lowfreq: -27.6445 -5.9548 -5.8076 -0.0016 -0.0013 0.0016 22.0487 30.4922 55.7864
frequency: -3.1624 28.0898 55.7558 101.3125 128.2895 155.6187 162.8029 186.6979 233.1517 240.4300 241.1532 262.2830 340.6087 384.9404 430.7213 457.5709 503.3848 529.5621 531.3136 563.0113 605.4855 641.0108 673.0841 734.0218 761.6144 793.6627 811.1798 859.6870 895.3453 911.4978 939.9599 967.8778 1015.2565 1049.3295 1079.2139 1105.7275 1152.2877 1153.9917 1161.4518 1220.7906 1267.0362 1280.9049 1288.5174 1300.0924 1336.6010 1351.2127 1358.5266 1382.4335 1393.4889 1455.2605 1466.8623 1473.3326 1480.2146 1485.8516 1497.6089 1508.1569 1544.8398 1582.9460 1611.1769 2940.9862 2963.5052 2974.0707 2977.1176 2980.6899 3008.8530 3038.3452 3073.9393 3078.6269 3217.0054 3549.4641 3564.1316 3723.8215
redmass: 1.5755 4.1451 5.0068 2.5192 2.4353 5.9844 4.2874 5.0998 2.7824 1.4443 3.9687 5.8742 4.3473 6.3005 3.1652 1.1975 1.1302 1.0709 4.0892 5.6480 7.8464 6.4931 3.6774 1.0769 4.0279 1.4941 1.3986 6.1431 4.1112 2.5349 1.1561 2.7364 3.2353 3.2236 2.2638 2.1468 1.7408 1.5752 3.0279 1.3078 1.4545 1.1488 1.0620 3.1037 1.7325 2.8330 1.7948 1.7440 1.2287 4.1336 1.0744 1.0752 1.0421 1.0685 1.1163 2.4652 3.4556 7.2371 1.7660 1.0573 1.0584 1.0591 1.0360 1.1027 1.1012 1.1047 1.1009 1.0994 1.0938 1.0765 1.0442 1.1060
irintensity: 0.6181 0.0137 0.3748 0.0776 5.5644 0.5858 0.1411 6.8342 0.1557 0.0051 2.0464 1.0751 11.3495 2.8311 0.2946 249.4162 163.1664 4.6858 11.0567 4.2787 9.6424 13.3349 0.1815 11.0040 5.7199 20.9422 27.3002 78.5424 2.4782 31.5729 0.3488 19.3322 0.7702 1.8587 0.9166 9.8588 22.4146 0.5979 16.3877 0.0426 5.6216 0.4537 0.1630 12.9441 51.5182 72.5719 28.4892 87.4529 1.9837 180.5635 0.3444 0.5701 13.5384 18.4336 69.3031 72.9272 242.0606 1094.2588 359.8396 30.6486 4.8685 68.5147 38.7062 16.8440 1.5248 53.3395 79.6989 46.2114 1.2715 48.9333 118.7975 48.8898
temp: 298.150 k
press: 1.00000 atm
elementType: 17 7 7 7 7 6 6 6 6 6 6 6 6 1 1 1 1 1 1 1 1 1 1 1 1 1
symmnumber: 1
zpe: 551626.8 jmol-1
zpe.correction: 0.210104 hartree
zpe.thermalcorrener: 0.223267 hartree
zpe.thermalcorrenthalpy: 0.224211 hartree
zpe.thermalcorrgfe: 0.169167 hartree
zpe.sumelectzpe: -990.746279 hartree
zpe.sumelectthermal: -990.733116 hartree
zpe.sumelectthermalent: -990.732172 hartree
zpe.sumelectthermalfe: -990.787215 hartree
dipole: -4.3159 -2.4568 -0.0055
dipole: 4.9662
quadrupole: -80.5421 -78.9234 -87.4914
quadrupole: -12.5731 -0.0550 0.0361
quadrupole: 1.7768 3.3956 -5.1724 -12.5731 -0.0550 0.0361
hfenergy: -990.9563826 hartree
pointgroup: C01 [X(C8H13Cl1N4)]
dipole: -1.601274 1.1192555 0.0261592 debye
dipolederiv: -0.2670126 0.2748515 0.0045378 0.3107931 -0.905306 -0.0125527 0.0051592 -0.0122994 -0.108925 -1.8145245 0.1034592 0.0082738 0.3995044 -0.309091 -0.0010386 0.0153635 0.0000175 -0.4567107 -1.5328874 -0.3340864 0.0019669 -0.2527956 -0.6213922 -0.003668 0.0029374 -0.0031147 -0.2746131 -0.8164837 -0.2468232 -0.0007544 -0.485436 -1.4952063 -0.0154886 -0.0041282 -0.0167755 -0.1937795 -0.9024638 -0.6709233 -0.0071261 -0.8034594 -0.9775639 0.0021746 -0.0055246 0.0046266 -0.7337314 -0.0452855 -0.0377463 0.0007423 -0.0944759 0.0747972 -0.0014563 -0.0002844 -0.0019577 0.1771183 0.6196676 0.1248121 0.0010803 0.4230959 0.2624702 -0.0027229 0.004394 -0.0011603 0.3533286 0.0436651 0.022986 0.0011611 0.0855957 0.0940279 -0.0017273 0.0020827 -0.001329 0.1734922 -0.0691731 0.0283904 0.0014819 -0.0226451 0.0585528 -0.000538 0.000678 -0.0007874 0.0962023 2.0571346 -0.0253655 -0.0098404 -0.6296192 0.8141526 0.0116792 -0.0182129 0.0089568 0.2051098 -0.9367586 0.196565 0.0064143 0.6578626 -0.6933079 -0.0093788 0.0124396 -0.0071867 -0.2240409 1.3451989 -0.0523886 -0.0067756 -0.1437966 1.7768048 0.0247407 -0.0080526 0.0242543 0.0410711 1.5309778 0.6260422 0.0012697 0.8045313 1.5598485 0.0137238 0.003441 0.0141554 0.2056863 0.049957 -0.0033261 -0.0051518 0.0214228 -0.0401991 0.1113067 -0.0027083 0.1279654 -0.072227 0.0502891 -0.0048881 0.003591 0.0199952 -0.0322482 -0.1100637 0.0019885 -0.1263888 -0.0798733 -0.018916 0.006534 0.0184838 -0.1082308 -0.0354563 -0.0955435 -0.0274314 -0.1056814 -0.08394 -0.0176112 0.0086349 -0.019366 -0.1067788 -0.0416942 0.0976815 0.022685 0.1065276 -0.0770252 0.0284353 0.0317625 -0.0381125 0.0030062 -0.041364 0.1172018 -0.0231666 0.1423409 -0.0778347 0.029167 0.028831 0.0377418 0.0008778 -0.0329884 -0.1157549 0.0219038 -0.1412901 -0.0869846 0.1821642 -0.0034662 0.0003585 -0.0673168 0.1498762 -0.0013417 -0.0017113 -0.0011637 0.3007053 0.0762604 0.007849 0.0121225 0.0620545 -0.0127393 0.1225908 -0.0364491 0.1334667 -0.0812187 -0.1511077 -0.1028852 -0.0000776 -0.1474823 -0.0147047 -0.0009327 -0.0007475 -0.0012177 0.1031474 0.0766087 0.0065553 -0.0139482 0.0593433 -0.0046523 -0.1208844 0.0363068 -0.1311044 -0.0895706 0.0436544 -0.0766385 -0.0005223 -0.0922867 0.0315212 -0.0020455 -0.000722 -0.0021679 0.1997758 0.2708436 0.0701484 0.0009697 0.0303749 0.1866546 -0.0030113 -0.0012148 -0.0043057 0.3934308 0.1682004 0.021116 0.0014795 0.0758654 0.2492081 -0.0029502 0.0009741 -0.0043809 0.3914068 unknown
polarizability: 180.9516001|-0.361026|142.5067689|-0.5669381|1.0217809|68.655255 unknown
InChI: InChI=1S/C8H13ClN4/c1-2-3-4-11-7-5-6(9)12-8(10)13-7/h5,11H,2-4,10H2,1H3
charge 0 multiplicity 1
26 atoms
Cl 2.894017 -2.9381 -0.060383
N  -0.905384 0.66638 0.007939
N  1.318292 1.364995 0.006857
N  3.166023 -0.242531 -0.023909
N  3.555284 2.065303 0.004396
C  -3.372041 0.449759 0.019928
C  -2.019895 -0.289311 -0.000712
C  -4.572771 -0.522455 0.011461
C  -5.93046 0.21154 0.031744
C  0.423879 0.320651 -0.003535
C  0.859881 -1.045542 -0.025022
C  2.251119 -1.220372 -0.033627
C  2.642433 1.037591 -0.004044
H  -3.436835 1.121608 -0.86046
H  -3.425581 1.092436 0.922496
H  -1.964318 -0.932651 -0.904438
H  -1.952735 -0.96116 0.881092
H  -4.503586 -1.197665 0.888146
H  -4.514411 -1.168842 -0.887452
H  -1.10178 1.669215 0.020354
H  -6.040154 0.869615 -0.85047
H  -6.772551 -0.503699 0.025749
H  -6.028752 0.841252 0.935733
H  0.171379 -1.888492 -0.034555
H  4.546458 1.841618 -0.000157
H  3.223488 3.025157 0.02277
