program: Gaussian 09
title: 000229859
version: EM64L-G09RevD.01
frameworkgroup: C1[X(C5H13NO4)]
method: RPBEPBE
basis: SDD
operation: Freq
keyword: #p
keyword: freq=noraman
keyword: PBEPBE/SDD
title: #p freq=noraman PBEPBE/SDD
converged: YES YES NO NO
title: Mulliken charges:
elementType: O O O O N C C C C C H H H H H H H H H H H H H
charge: -0.489994 -0.447693 -0.481914 -0.479905 -0.573789 -0.105700 -0.070331 -0.121029 -0.432928 -0.380721 0.211098 0.198086 0.266069 0.231141 0.236471 0.213479 0.226430 0.368405 0.353871 0.367590 0.280784 0.265302 0.365278
chargesum: 0.00000
title: Mulliken charges with hydrogens summed into heavy atoms:
elementType: O O O O N C C C C C
charge: -0.121590 -0.093822 -0.114324 -0.114627 -0.027703 0.105398 0.127755 0.145039 0.034684 0.059189
polarizability: 8.09275699e+01 2.22130140e+00 7.65984035e+01 -1.90028498e+00 1.72850849e+00 6.80762462e+01
1716.lowfreq: -12.6729 -7.6561 -0.0005 -0.0001 0.0004 6.6137 45.8549 59.4011 104.2430
frequency: 45.6335 59.3743 104.2383 120.6970 161.1112 194.2879 239.9890 269.0919 279.1667 282.8581 300.3889 349.6332 382.3382 429.6079 466.4729 499.8242 522.6611 557.2936 613.0343 661.5842 697.6227 823.8232 860.5980 885.3414 908.0668 958.2860 979.5263 1003.9555 1048.9488 1060.9583 1085.7624 1101.8869 1134.5260 1152.5695 1184.6243 1209.8975 1250.0146 1285.2343 1292.4249 1309.3904 1319.6988 1342.6432 1346.4457 1368.9061 1379.7036 1389.6255 1397.9401 1458.0344 1468.5564 1633.1669 2975.8964 2980.6771 3002.7581 3009.2138 3041.0659 3064.9575 3070.1020 3425.4499 3461.1320 3464.3410 3504.6327 3606.8384 3637.2512
redmass: 4.1468 5.2591 2.9388 4.9320 2.9532 3.1471 3.9190 1.4885 1.1490 3.1466 2.5846 2.3690 1.5681 4.0423 3.6059 3.0044 1.1440 1.2061 3.9515 2.2234 1.2578 2.3745 4.1896 1.7360 2.2640 3.9632 2.9362 2.9939 2.4029 2.9960 1.8540 3.8025 1.5440 1.1328 1.2228 1.2824 1.2290 1.3630 1.2682 1.2553 1.1691 1.2633 1.2471 1.2687 1.2937 1.4234 1.5143 1.0843 1.0821 1.0960 1.0834 1.0559 1.0674 1.0783 1.1081 1.0868 1.1050 1.0643 1.0644 1.0641 1.0441 1.0671 1.1003
irintensity: 2.2725 1.1720 0.8513 1.5524 8.0166 10.2844 28.8297 57.9067 96.0351 22.1810 42.3975 25.4700 321.0925 10.6041 11.1780 11.8369 166.4326 85.7779 40.4732 65.8130 185.9152 9.5762 52.3865 15.8821 37.7919 52.9133 49.3679 28.4642 58.6175 27.8219 27.1045 22.9701 6.8019 25.5461 28.1499 41.4703 23.0222 45.9827 43.7911 6.2112 8.2139 1.4186 3.9737 79.5974 44.6090 8.3308 4.9000 10.7765 17.5281 33.9555 31.1488 36.1416 15.3870 70.0131 41.4543 15.4353 28.0826 82.8119 35.2767 16.7458 1.1491 11.4902 2.4090
temp: 298.150 k
press: 1.00000 atm
elementType: 8 8 8 8 7 6 6 6 6 6 1 1 1 1 1 1 1 1 1 1 1 1 1
symmnumber: 1
zpe: 503160.0 jmol-1
zpe.correction: 0.191644 hartree
zpe.thermalcorrener: 0.203927 hartree
zpe.thermalcorrenthalpy: 0.204871 hartree
zpe.thermalcorrgfe: 0.153530 hartree
zpe.sumelectzpe: -553.089536 hartree
zpe.sumelectthermal: -553.077253 hartree
zpe.sumelectthermalent: -553.076309 hartree
zpe.sumelectthermalfe: -553.127650 hartree
dipole: 3.9845 3.7746 0.9564
dipole: 5.5712
quadrupole: -63.0465 -57.9717 -62.3781
quadrupole: 7.1511 1.9471 5.0907
quadrupole: -1.9144 3.1604 -1.2460 7.1511 1.9471 5.0907
hfenergy: -553.28118 hartree
pointgroup: C01 [X(C5H13N1O4)]
dipole: 1.6515912 0.6243917 -1.2987645 debye
dipolederiv: -0.4967899 -0.0806282 0.0581534 -0.0454915 -0.7493116 0.1413746 -0.0318841 0.085262 -0.577445 -0.7139548 0.0660014 0.0074105 0.0676149 -0.2750914 -0.1494517 -0.0371521 -0.1172202 -0.8171352 -0.885922 0.0622599 -0.0849559 0.0690552 -0.639111 0.1146813 -0.1169842 0.1127891 -0.3123529 -0.5118329 0.1700951 0.0229961 0.2248635 -0.3867288 -0.1493926 0.0936119 -0.1321612 -0.7184524 -0.8852285 -0.1479059 -0.3414617 -0.1855502 -0.2219251 -0.1297594 -0.305703 -0.1116742 -0.7288656 0.0531834 0.0666992 -0.0530662 -0.0064879 0.332188 -0.176255 -0.0287143 -0.0703167 0.334263 0.2585111 0.0102138 -0.0906044 -0.0846159 0.2430722 -0.0143087 0.0036507 0.0010405 0.5122736 0.5148841 -0.1671058 0.0694556 -0.1079644 0.3332681 0.0318399 0.0917255 -0.0010773 0.1575182 0.2959189 0.0082808 0.0472536 0.0917201 0.146776 0.0639427 0.1713952 0.0442281 0.5194985 0.3416052 -0.1227763 -0.0457632 -0.1001429 0.2419898 0.1779367 -0.1085994 0.2013404 0.4572439 0.0737489 -0.004758 0.0430756 -0.0002093 -0.0114882 -0.0691146 0.0346853 -0.0256154 -0.1611819 0.0332372 -0.073326 0.0332259 -0.0786291 -0.1136652 0.0941207 0.0328527 0.0785744 -0.0331665 0.0909402 0.029634 0.0097845 0.0003968 0.0088744 -0.0289822 -0.0169073 -0.0691616 -0.0332539 0.0897932 -0.0401094 -0.0092288 -0.082792 -0.0629113 0.0688272 0.0204202 0.0584017 -0.0022474 -0.0966786 0.1002831 0.0172476 0.1228292 -0.0057932 -0.0693082 0.0155555 -0.040608 0.0170975 0.0022936 0.1470155 -0.0368703 0.1355662 -0.0667575 0.0011939 -0.0605319 0.0535079 -0.0113582 -0.1364523 -0.1157331 -0.0373159 -0.0532968 -0.0081095 -0.0844775 -0.0266768 -0.0873464 -0.0110334 0.3221353 0.1163552 -0.0537568 0.0926642 0.3506745 -0.0155885 0.0189781 -0.0051094 0.30911 0.4177609 -0.0532018 -0.040503 -0.07832 0.1416089 0.0813945 -0.0420872 0.0376561 0.3128484 0.3470776 0.0165526 0.0205601 0.0305409 0.3472207 -0.0664173 0.0257123 -0.0957528 0.2006844 0.2758999 0.1800937 0.1750705 0.1362338 0.1440776 0.0292707 0.0831656 0.0199221 0.1631915 0.3626167 -0.0757429 0.1719662 -0.0077592 0.0520142 0.0735772 0.079327 0.0196544 0.1446604 0.2472525 -0.0921969 0.1173267 -0.1402258 0.1991282 0.0748965 0.1041604 0.0436665 0.2781028 unknown
polarizability: 80.9115109|-1.8816547|69.5540929|-2.6268686|-3.4051945|75.1366158 unknown
InChI: InChI=1S/C5H13NO4/c6-1-3(8)5(10)4(9)2-7/h3-5,7-10H,1-2,6H2
charge 0 multiplicity 1
23 atoms
O  -0.529439 -1.486263 1.143923
O  -1.514384 0.952831 1.776158
O  2.086034 -0.976489 1.104449
O  2.391223 0.040004 -1.361917
N  -2.552893 0.02903 -1.782864
C  -0.143532 -0.381153 0.246718
C  -1.285968 0.652128 0.35553
C  1.226179 0.168192 0.724955
C  -2.599705 0.153311 -0.322071
C  1.950371 1.009607 -0.332092
H  -0.050219 -0.748682 -0.796838
H  -0.982889 1.611764 -0.106588
H  1.073229 0.751057 1.649527
H  -2.862506 -0.830084 0.109135
H  -3.401729 0.858574 -0.036507
H  1.269417 1.766397 -0.768052
H  2.823385 1.515299 0.124713
H  0.332526 -1.899272 1.4359
H  -1.511807 0.062631 2.226593
H  2.539229 -1.26021 0.261639
H  -2.047005 -0.771289 -2.162938
H  -2.434101 0.891779 -2.315418
H  3.062383 0.453137 -1.956954
