program: Gaussian 09
title: 000229857
version: EM64L-G09RevD.01
frameworkgroup: C1[X(C8H9NO)]
method: RPBEPBE
basis: SDD
operation: Freq
keyword: #pfreq=noraman
keyword: PBEPBE/SDD
title: #p freq=noraman PBEPBE/SDD
converged: YES YES NO NO
title: Mulliken charges:
elementType: O N C C C C C C C C H H H H H H H H H
charge: -0.444252 -0.176538 -0.426291 -0.424024 0.444263 -0.531887 -0.429410 0.342203 -0.160460 -0.433675 0.239562 0.235094 0.236394 0.240132 0.259952 0.237098 0.221316 0.218449 0.352076
chargesum: 0.00000
title: Mulliken charges with hydrogens summed into heavy atoms:
elementType: O N C C C C C C C C
charge: -0.092176 -0.176538 0.048365 0.052501 0.444263 -0.271934 -0.192313 0.342203 0.060856 -0.215226
polarizability: 1.38904994e+02 1.96605213e+00 1.01455483e+02 4.59401738e+00 1.87458449e+00 4.83974604e+01
1716.lowfreq: -20.1516 -8.0916 -6.2811 -0.0011 -0.0009 -0.0008 64.7034 125.3756 168.0572
frequency: 64.5516 125.3662 168.0537 224.0246 279.7723 348.2743 357.8020 435.0909 456.6508 491.4030 521.1517 606.8120 671.4795 683.8884 758.9400 803.6952 819.7703 842.8041 860.0676 882.5169 947.5030 949.1938 980.3285 993.3090 1078.4738 1084.5686 1096.0890 1110.0772 1116.0218 1139.0129 1153.8955 1172.2420 1232.7584 1293.5538 1360.7041 1391.8076 1458.9155 1472.3557 1476.0836 1483.9202 1585.3428 1629.3533 3059.5667 3067.4153 3120.3841 3139.5382 3160.5580 3166.0300 3166.8297 3182.6137 3585.2620
redmass: 3.0633 3.5258 2.9277 4.4751 3.8469 1.1109 4.3179 4.9452 3.1627 3.7194 6.5230 4.4334 4.3807 2.1542 1.5289 1.2477 2.7186 1.4692 1.7318 6.1492 2.5321 1.3263 5.9133 1.1069 1.3542 1.4759 1.3387 1.3802 1.8183 1.4139 1.5076 1.1317 2.4366 1.3640 3.4218 7.2509 1.0762 2.9484 1.2866 2.8002 6.7960 6.2773 1.0489 1.0609 1.0872 1.0911 1.0975 1.1085 1.1009 1.1166 1.0660
irintensity: 2.0513 10.4047 0.5050 0.7218 10.2009 140.5940 7.0365 11.3370 4.9677 1.3920 2.8313 5.9601 1.0938 36.5278 61.3586 10.9488 33.8915 0.3614 32.9335 0.8094 82.7874 2.4109 3.4618 5.1249 15.3560 3.3655 3.9712 8.4948 118.2114 0.1095 108.4858 14.1794 9.6018 32.1408 69.0244 17.4156 3.5434 16.3290 43.7041 134.4644 78.7543 206.3963 23.4672 45.9960 8.9540 20.4335 18.0030 0.6229 0.9080 38.6767 33.4659
temp: 298.150 k
press: 1.00000 atm
elementType: 8 7 6 6 6 6 6 6 6 6 1 1 1 1 1 1 1 1 1
symmnumber: 1
zpe: 396297.8 jmol-1
zpe.correction: 0.150942 hartree
zpe.thermalcorrener: 0.159793 hartree
zpe.thermalcorrenthalpy: 0.160737 hartree
zpe.thermalcorrgfe: 0.117028 hartree
zpe.sumelectzpe: -439.437200 hartree
zpe.sumelectthermal: -439.428348 hartree
zpe.sumelectthermalent: -439.427404 hartree
zpe.sumelectthermalfe: -439.471113 hartree
dipole: -0.1716 0.9130 1.5948
dipole: 1.8457
quadrupole: -42.9848 -57.1988 -63.8278
quadrupole: 2.7565 -0.6804 0.2110
quadrupole: 11.6856 -2.5283 -9.1573 2.7565 -0.6804 0.2110
hfenergy: -439.5881414 hartree
pointgroup: C01 [X(C8H9N1O1)]
dipole: 0.1256051 0.58062 -0.4175997 debye
dipolederiv: -0.8538071 -0.5412237 -0.2727335 -0.6642683 -0.5817451 -0.181515 -0.3525294 -0.1734343 -0.5591045 -1.4759037 0.3408081 0.1200747 0.5606255 -0.2278047 0.1138144 -0.2938359 0.2243546 -0.3952798 0.3804246 0.0051643 0.0507083 -0.000797 0.0212946 -0.0757089 0.0934686 -0.1103872 0.2188148 0.2448327 -0.1607418 -0.0401235 -0.2012207 0.1503985 -0.0838954 0.0052027 -0.0785386 0.2045114 1.3935525 -0.3136769 0.0765515 -0.5192685 0.3089395 0.0277469 0.2979648 -0.024003 0.0844216 -0.6771936 -0.0785087 -0.0703126 -0.1077463 -0.0360582 0.0287034 -0.1209589 0.0415242 -0.2204335 -0.4212446 0.0865198 0.0530938 0.3660366 -0.242546 0.0552254 0.1230656 0.0215542 -0.1927218 1.0037301 0.3617522 0.3118058 0.4990874 0.6090018 0.2928791 0.3963073 0.271046 0.2787556 0.3834128 -0.03496 0.0869301 0.028852 0.1273037 0.0876823 0.116587 0.0802251 -0.0546348 -0.253252 0.0106198 0.0288402 -0.2823879 -0.3630849 -0.100042 -0.1076514 -0.0345224 -0.2991654 -0.0739314 -0.0420108 -0.0825362 -0.0836484 0.0645639 0.0082418 -0.1429667 -0.0039693 0.0253933 0.0210367 0.0211892 -0.0526167 -0.0591083 -0.052263 0.1051054 0.0555828 0.0906541 0.0229232 0.0354297 0.0354595 -0.0959652 0.0158521 0.0628879 -0.0084197 0.0288828 -0.05753 -0.1044517 0.0501632 0.0876192 -0.0158572 0.1582887 -0.0810067 -0.0110746 -0.0154777 0.0176087 0.0535305 0.0929646 0.0570895 -0.0022123 0.0479915 -0.0137788 -0.061458 -0.0118854 -0.0625763 0.1439562 -0.0132234 -0.0793382 -0.0771642 -0.0592244 0.0403334 -0.0585257 -0.0685127 -0.0600302 0.1302746 0.0670676 0.0547469 0.0082457 0.0639549 -0.0908775 -0.0837828 0.0069352 -0.0808864 0.1198614 -0.1322783 0.050039 -0.0464814 0.0322783 0.0832043 -0.0336468 -0.0574684 -0.0291781 0.1659687 0.2282197 0.1394525 0.0197526 0.2047027 0.2212371 -0.0213297 0.0472897 -0.0319113 0.3773802 unknown
polarizability: 137.5195926|-7.2741851|94.4531741|9.350919|18.0110018|56.7851701 unknown
InChI: InChI=1S/C8H9NO/c10-8-3-1-2-7(6-8)9-4-5-9/h1-3,6,10H,4-5H2
charge 0 multiplicity 1
19 atoms
O  -2.690129 -1.215917 -0.869849
N  1.872971 -0.386421 0.549706
C  3.087563 0.32287 0.05711
C  2.683094 -1.039547 -0.51595
C  0.552489 0.095032 0.339698
C  -0.434204 -0.764417 -0.205358
C  0.196906 1.406477 0.765057
C  -1.763409 -0.309037 -0.318436
C  -1.138104 1.83837 0.640057
C  -2.134449 0.9926 0.100216
H  3.921239 0.392209 0.763074
H  2.944564 1.198928 -0.589887
H  2.275125 -1.05152 -1.535769
H  3.228774 -1.940706 -0.218886
H  -0.183653 -1.778968 -0.528776
H  0.960856 2.062104 1.195458
H  -1.411609 2.847467 0.968179
H  -3.171406 1.338593 0.007448
H  -3.592619 -0.812417 -0.901994
